{"text_format":"1","workbook":"xlsx","n_sheets":89,"sheets":["ED70P","ED120P","ED160P","ED10R WBP1","ED10R WBF4","ED7R WBF3","EK730P","EK740F","EK750F","EG730P","EG740F","EG500P","EG500F","EG502P","EG502F","EG501P","EG501F","EG503P","EG503F","EG640F","EG640P","EG641P","EG641F","EG642P","EG642F","EG643P","EG643F","EG644P","EG644F","EG645P","EG645F","EG646P","EG646F","EG647P","EG647F","EG650P","EG660F","EG651P","EG661F","EG652P","EG662F","EG653P","EG663F","EG670F","EG671F","EG672F","EG670PF U","EG670PF L","EG671PF U","EG671PF L","EG672PF U","EG672PF L","EG670PP U","EG671PP U","EG670PP L","EG671PP L","EG672PP U","EG673PP U","EG672PP L","EG673PP L","EG6R DDxxB","EG8R DCxxB","EG9R DCxxB","EG10R DCxxB","EG25R DAxx","EG11R DDxxyy U","EG11R DDxxyy L","EG11R DDxxyy L&U","EG12R DCxxyy U","EG12R DCxxyy L","EG12R DCxxyy L&U","EG13R DCxxyy U","EG13R DCxxyy L","EG13R DCxxyy U&L","EG16R DCxxyy U","EG16R DCxxyy L","EG16R DCxxyy U&L","None","REF","CHART","Gearbox oil cooler","GEM Startblad","PTO lathund 3","PTO Technical data","Hydraulic pumpdata","Cranes","PTO GZ","EG PTO GW","EG PTO GW adaption"],"not_rendered":{"charts":1,"images":77,"macros":1,"external_links":0,"defined_names":84,"comments":2,"pivot_tables":0},"unopened":[],"bounds":{"document_bytes":16777216,"sheet_cells":100000,"rows_first":2000,"rows_last":500,"rows_between":2000,"halvings":0,"cell_chars":16384,"cell_head_chars":4096},"cells_cut":0,"cells_raw":0,"read":"whole","date_system":"1900"}

{"sheet":"ED70P","index":0,"n_rows":35,"n_cols":4,"rows_kept":35,"cut":false,"hidden":false,"merged":[[0,0,0,3]]}
["ED70P"]
["Power (kW)","Engine LS ","Power take-off (rpm)","(Nm)"]
[50,800,{"$f":"B3*1.2","v":960},{"$f":"A3*9550/C3","v":497.39583333333331}]
[50,900,1080,442.12962962962962]
[50,{"$f":"B4+100","v":1000},1200,397.91666666666669]
[50,1100,1320,361.74242424242425]
[50,1200,1440,331.59722222222223]
[50,1300,1560,306.08974358974359]
[50,1400,1680,284.22619047619048]
[50,1500,1800,265.27777777777777]
[50,1600,1920,248.69791666666666]
[50,1700,2040,234.06862745098039]
[50,1800,2160,221.06481481481481]
[50,1900,2280,209.42982456140351]
["Power (kW)","Engine LS","Power take-off (rpm)","(Nm)"]
[50,800,{"$f":"B16*1.2","v":960},{"$f":"A16*9550/C16","v":497.39583333333331}]
[50,900,1080,442.12962962962962]
[50,{"$f":"B17+100","v":1000},1200,397.91666666666669]
[50,1100,1320,361.74242424242425]
[50,1200,1440,331.59722222222223]
[50,1300,1560,306.08974358974359]
[50,1400,1680,284.22619047619048]
[50,1500,1800,265.27777777777777]
[50,1600,1920,248.69791666666666]
[50,1700,2040,234.06862745098039]
[50,1800,2160,221.06481481481481]
[50,1900,2280,209.42982456140351]
["Power (kW)","Engine LS","Power take-off (rpm)","(Nm)"]
[113,1700,{"$f":"B29*1.2","v":2040},{"$f":"A29*9550/C29","v":528.99509803921569}]
[113,{"$f":"B29+100","v":1800},2160,499.60648148148147]
[113,1900,{"$f":"B31*1.2","v":2280},473.31140350877195]
["Power (kW)","Engine HS","Power take-off (rpm)","(Nm)"]
[113,1700,{"$f":"B33*1.2","v":2040},{"$f":"A33*9550/C33","v":528.99509803921569}]
[113,{"$f":"B33+100","v":1800},2160,499.60648148148147]
[113,1900,{"$f":"B35*1.2","v":2280},473.31140350877195]

{"sheet":"ED120P","index":1,"n_rows":29,"n_cols":4,"rows_kept":29,"cut":false,"hidden":false,"merged":[[0,0,0,3]]}
["ED120P"]
["Power (kW)","Engine HS","Power take-off (rpm)","(Nm)"]
[75,1000,{"$f":"B3*1.19","v":1190},{"$f":"A3*9550/C3","v":601.89075630252103}]
[75,{"$f":"B3+100","v":1100},1309,547.17341482047368]
[75,1200,1428,501.57563025210084]
[75,1300,1547,462.9928894634777]
[75,1400,1666,429.92196878751503]
[75,1500,1785,401.26050420168065]
[75,1600,1904,376.18172268907563]
[75,1700,2023,354.05338606030648]
[75,1800,2142,334.38375350140058]
[75,1900,2261,316.78460858027421]
["Power (kW)","Engine LS","Power take-off (rpm)","(Nm)"]
[75,1000,{"$f":"B14*1.19","v":1190},{"$f":"A14*9550/C14","v":601.89075630252103}]
[75,{"$f":"B14+100","v":1100},1309,547.17341482047368]
[75,1200,1428,501.57563025210084]
[75,1300,1547,462.9928894634777]
[75,1400,1666,429.92196878751503]
[75,1500,1785,401.26050420168065]
[75,1600,1904,376.18172268907563]
[75,1700,2023,354.05338606030648]
[75,1800,2142,334.38375350140058]
[75,1900,2261,316.78460858027421]
["Power (kW)","Engine LS","Power take-off (rpm)","(Nm)"]
[142,1800,{"$f":"B25*1.19","v":2142},{"$f":"A25*9550/C25","v":633.09990662931841}]
[142,{"$f":"B25+100","v":1900},2261,599.77885891198582]
["Power (kW)","Engine HS","Power take-off (rpm)","(Nm)"]
[142,1800,{"$f":"B28*1.19","v":2142},{"$f":"A28*9550/C28","v":633.09990662931841}]
[142,{"$f":"B28+100","v":1900},2261,599.77885891198582]

{"sheet":"ED160P","index":2,"n_rows":33,"n_cols":4,"rows_kept":33,"cut":false,"hidden":false,"merged":[[0,0,0,3]]}
["ED160P"]
["Power (kW)","Engine LS","Power take-off (rpm)","(Nm)"]
[85,800,{"$f":"B3*1.19","v":952},{"$f":"A3*9550/C3","v":852.67857142857144}]
[85,900,1071,757.93650793650795]
[85,{"$f":"B4+100","v":1000},1190,682.14285714285711]
[85,1100,1309,620.12987012987014]
[85,1200,1428,568.45238095238096]
[85,1300,1547,524.72527472527474]
[85,1400,1666,487.24489795918367]
[85,1500,1785,454.76190476190476]
[85,1600,1904,426.33928571428572]
[85,1700,2023,401.26050420168065]
[85,1800,2142,378.96825396825398]
[85,1900,2261,359.02255639097746]
["Power (kW)","Engine HS","Power take-off (rpm)","(Nm)"]
[85,800,{"$f":"B16*1.19","v":952},{"$f":"A16*9550/C16","v":852.67857142857144}]
[85,900,1071,757.93650793650795]
[85,{"$f":"B17+100","v":1000},1190,682.14285714285711]
[85,1100,1309,620.12987012987014]
[85,1200,1428,568.45238095238096]
[85,1300,1547,524.72527472527474]
[85,1400,1666,487.24489795918367]
[85,1500,1785,454.76190476190476]
[85,1600,1904,426.33928571428572]
[85,1700,2023,401.26050420168065]
[85,1800,2142,378.96825396825398]
[85,1900,2261,359.02255639097746]
["Power (kW)","Engine LS","Power take-off (rpm)","(Nm)"]
[189,1800,{"$f":"B29*1.19","v":2142},{"$f":"A29*9550/C29","v":842.64705882352939}]
[189,{"$f":"B29+100","v":1900},2261,798.297213622291]
["Power (kW)","Engine HS","Power take-off (rpm)","(Nm)"]
[189,1800,2142,{"$f":"A32*9550/C32","v":842.64705882352939}]
[189,{"$f":"B32+100","v":1900},2261,798.297213622291]

{"sheet":"ED10R WBP1","index":3,"n_rows":7,"n_cols":4,"rows_kept":7,"cut":false,"hidden":false,"merged":[[0,0,0,3]]}
["ED10R WBP1"]
["Power (kW)","Engine LS","Power take-off (rpm)","(Nm)"]
[238,1800,{"$f":"B3*1.2","v":2160},{"$f":"A3*9550/C3","v":1052.2685185185185}]
[238,{"$f":"B3+100","v":1900},2280,996.88596491228066]
["Power (kW)","Engine HS","Power take-off (rpm)","(Nm)"]
[238,1800,{"$f":"B6*1.2","v":2160},{"$f":"A6*9550/C6","v":1052.2685185185185}]
[238,{"$f":"B6+100","v":1900},2280,996.88596491228066]

{"sheet":"ED10R WBF4","index":4,"n_rows":7,"n_cols":4,"rows_kept":7,"cut":false,"hidden":false,"merged":[[0,0,0,3]]}
["ED10R WBF4"]
["Power (kW)","Engine LS","Power take-off (rpm)","(Nm)"]
[238,1800,{"$f":"B3*1.2","v":2160},{"$f":"A3*9550/C3","v":1052.2685185185185}]
[238,{"$f":"B3+100","v":1900},2280,996.88596491228066]
["Power (kW)","Engine HS","Power take-off (rpm)","(Nm)"]
[238,1800,{"$f":"B6*1.2","v":2160},{"$f":"A6*9550/C6","v":1052.2685185185185}]
[238,{"$f":"B6+100","v":1900},2280,996.88596491228066]

{"sheet":"ED7R WBF3","index":5,"n_rows":7,"n_cols":4,"rows_kept":7,"cut":false,"hidden":false,"merged":[[0,0,0,3]]}
["ED7R WBF3"]
["Power (kW)","Engine LS","Power take-off (rpm)","(Nm)"]
[167,1800,{"$f":"B3*1.2","v":2160},{"$f":"A3*9550/C3","v":738.35648148148152}]
[167,{"$f":"B3+100","v":1900},{"$f":"B4*1.2","v":2280},699.49561403508767]
["Power (kW)","Engine HS","Power take-off (rpm)","(Nm)"]
[167,1800,{"$f":"B6*1.2","v":2160},{"$f":"A6*9550/C6","v":738.35648148148152}]
[167,{"$f":"B6+100","v":1900},2280,699.49561403508767]

{"sheet":"EK730P","index":6,"n_rows":97,"n_cols":4,"rows_kept":97,"cut":false,"hidden":false,"merged":[[0,0,0,3]]}
["EK730P"]
["Power (kW)","Engine LS","Power take-off (rpm)","(Nm)"]
[120,800,{"$f":"B3*1","v":800},{"$f":"A3*9550/C3","v":1432.5}]
[120,{"$f":"B3+100","v":900},900,1273.3333333333333]
[120,1000,1000,1146]
[120,1100,1100,1041.8181818181818]
[120,1200,1200,955]
[120,1300,1300,881.53846153846155]
[120,1400,1400,818.57142857142856]
[120,1500,1500,764]
[120,1600,1600,716.25]
[120,1700,1700,674.11764705882354]
[120,1800,1800,636.66666666666663]
[120,1900,{"$f":"B14*1","v":1900},603.15789473684208]
["Power (kW)","Engine HS","Power take-off (rpm)","(Nm)"]
[120,800,{"$f":"B16*1","v":800},{"$f":"A16*9550/C16","v":1432.5}]
[120,{"$f":"B16+100","v":900},900,1273.3333333333333]
[120,1000,1000,1146]
[120,1100,1100,1041.8181818181818]
[120,1200,1200,955]
[120,1300,1300,881.53846153846155]
[120,1400,1400,818.57142857142856]
[120,1500,1500,764]
[120,1600,1600,716.25]
[120,1700,1700,674.11764705882354]
[120,1800,1800,636.66666666666663]
[120,1900,{"$f":"B27*1","v":1900},603.15789473684208]
["Power (kW)","Engine LS","Power take-off (rpm)","(Nm)"]
[170,800,{"$f":"B29*1","v":800},{"$f":"A29*9550/C29","v":2029.375}]
[170,{"$f":"B29+100","v":900},900,1803.8888888888889]
[170,1000,1000,1623.5]
[170,1100,1100,1475.909090909091]
[170,1200,1200,1352.9166666666667]
[170,1300,1300,1248.8461538461538]
[170,1400,1400,1159.6428571428571]
[170,1500,1500,1082.3333333333333]
[170,1600,1600,1014.6875]
[170,1700,1700,955]
[170,1800,1800,901.94444444444446]
[170,1900,1900,854.47368421052636]
["Power (kW)","Engine HS","Power take-off (rpm)","(Nm)"]
[170,800,{"$f":"B42*1","v":800},{"$f":"A42*9550/C42","v":2029.375}]
[170,{"$f":"B42+100","v":900},900,1803.8888888888889]
[170,1000,1000,1623.5]
[170,1100,1100,1475.909090909091]
[170,1200,1200,1352.9166666666667]
[170,1300,1300,1248.8461538461538]
[170,1400,1400,1159.6428571428571]
[170,1500,1500,1082.3333333333333]
[170,1600,1600,1014.6875]
[170,1700,1700,955]
[170,1800,1800,901.94444444444446]
[170,1900,1900,854.47368421052636]
["Power (kW)","Engine LS","Power take-off (rpm)","(Nm)"]
[200,900,{"$f":"B55*1","v":900},{"$f":"A55*9550/C55","v":2122.2222222222222}]
[200,{"$f":"B55+100","v":1000},1000,1910]
[200,1100,1100,1736.3636363636363]
[200,1200,1200,1591.6666666666667]
[200,1300,1300,1469.2307692307693]
[200,1400,1400,1364.2857142857142]
[200,1500,1500,1273.3333333333333]
[200,1600,1600,1193.75]
[200,1700,1700,1123.5294117647059]
[200,1800,1800,1061.1111111111111]
[200,1900,1900,1005.2631578947369]
["Power (kW)","Engine HS","Power take-off (rpm)","(Nm)"]
[200,900,{"$f":"B67*1","v":900},{"$f":"A67*9550/C67","v":2122.2222222222222}]
[200,{"$f":"B67+100","v":1000},1000,1910]
[200,1100,1100,1736.3636363636363]
[200,1200,1200,1591.6666666666667]
[200,1300,1300,1469.2307692307693]
[200,1400,1400,1364.2857142857142]
[200,1500,1500,1273.3333333333333]
[200,1600,1600,1193.75]
[200,1700,1700,1123.5294117647059]
[200,1800,1800,1061.1111111111111]
[200,1900,1900,1005.2631578947369]
["Power (kW)","Engine LS","Power take-off (rpm)","(Nm)"]
[250,1100,{"$f":"B79*1","v":1100},{"$f":"A79*9550/C79","v":2170.4545454545455}]
[250,{"$f":"B79+100","v":1200},1200,1989.5833333333333]
[250,1300,1300,1836.5384615384614]
[250,1400,1400,1705.3571428571429]
[250,1500,1500,1591.6666666666667]
[250,1600,1600,1492.1875]
[250,1700,1700,1404.4117647058824]
[250,1800,1800,1326.3888888888889]
[250,1900,1900,1256.578947368421]
["Power (kW)","Engine HS","Power take-off (rpm)","(Nm)"]
[250,1100,1100,{"$f":"A89*9550/C89","v":2170.4545454545455}]
[250,{"$f":"B89+100","v":1200},1200,1989.5833333333333]
[250,1300,1300,1836.5384615384614]
[250,1400,1400,1705.3571428571429]
[250,1500,1500,1591.6666666666667]
[250,1600,1600,1492.1875]
[250,1700,1700,1404.4117647058824]
[250,1800,1800,1326.3888888888889]
[250,1900,1900,1256.578947368421]

{"sheet":"EK740F","index":7,"n_rows":97,"n_cols":4,"rows_kept":97,"cut":false,"hidden":false,"merged":[[0,0,0,3]]}
["EK740F"]
["Power (kW)","Engine LS","Power take-off (rpm)","(Nm)"]
[120,800,{"$f":"B3*1","v":800},{"$f":"A3*9550/C3","v":1432.5}]
[120,{"$f":"B3+100","v":900},900,1273.3333333333333]
[120,1000,1000,1146]
[120,1100,1100,1041.8181818181818]
[120,1200,1200,955]
[120,1300,1300,881.53846153846155]
[120,1400,1400,818.57142857142856]
[120,1500,1500,764]
[120,1600,1600,716.25]
[120,1700,1700,674.11764705882354]
[120,1800,1800,636.66666666666663]
[120,1900,{"$f":"B14*1","v":1900},603.15789473684208]
["Power (kW)","Engine HS","Power take-off (rpm)","(Nm)"]
[120,800,{"$f":"B16*1","v":800},{"$f":"A16*9550/C16","v":1432.5}]
[120,{"$f":"B16+100","v":900},900,1273.3333333333333]
[120,1000,1000,1146]
[120,1100,1100,1041.8181818181818]
[120,1200,1200,955]
[120,1300,1300,881.53846153846155]
[120,1400,1400,818.57142857142856]
[120,1500,1500,764]
[120,1600,1600,716.25]
[120,1700,1700,674.11764705882354]
[120,1800,1800,636.66666666666663]
[120,1900,{"$f":"B27*1","v":1900},603.15789473684208]
["Power (kW)","Engine LS","Power take-off (rpm)","(Nm)"]
[170,800,{"$f":"B29*1","v":800},{"$f":"A29*9550/C29","v":2029.375}]
[170,{"$f":"B29+100","v":900},900,1803.8888888888889]
[170,1000,1000,1623.5]
[170,1100,1100,1475.909090909091]
[170,1200,1200,1352.9166666666667]
[170,1300,1300,1248.8461538461538]
[170,1400,1400,1159.6428571428571]
[170,1500,1500,1082.3333333333333]
[170,1600,1600,1014.6875]
[170,1700,1700,955]
[170,1800,1800,901.94444444444446]
[170,1900,1900,854.47368421052636]
["Power (kW)","Engine HS","Power take-off (rpm)","(Nm)"]
[170,800,{"$f":"B42*1","v":800},{"$f":"A42*9550/C42","v":2029.375}]
[170,{"$f":"B42+100","v":900},900,1803.8888888888889]
[170,1000,1000,1623.5]
[170,1100,1100,1475.909090909091]
[170,1200,1200,1352.9166666666667]
[170,1300,1300,1248.8461538461538]
[170,1400,1400,1159.6428571428571]
[170,1500,1500,1082.3333333333333]
[170,1600,1600,1014.6875]
[170,1700,1700,955]
[170,1800,1800,901.94444444444446]
[170,1900,1900,854.47368421052636]
["Power (kW)","Engine LS","Power take-off (rpm)","(Nm)"]
[200,900,{"$f":"B55*1","v":900},{"$f":"A55*9550/C55","v":2122.2222222222222}]
[200,{"$f":"B55+100","v":1000},1000,1910]
[200,1100,1100,1736.3636363636363]
[200,1200,1200,1591.6666666666667]
[200,1300,1300,1469.2307692307693]
[200,1400,1400,1364.2857142857142]
[200,1500,1500,1273.3333333333333]
[200,1600,1600,1193.75]
[200,1700,1700,1123.5294117647059]
[200,1800,1800,1061.1111111111111]
[200,1900,1900,1005.2631578947369]
["Power (kW)","Engine HS","Power take-off (rpm)","(Nm)"]
[200,900,{"$f":"B67*1","v":900},{"$f":"A67*9550/C67","v":2122.2222222222222}]
[200,{"$f":"B67+100","v":1000},1000,1910]
[200,1100,1100,1736.3636363636363]
[200,1200,1200,1591.6666666666667]
[200,1300,1300,1469.2307692307693]
[200,1400,1400,1364.2857142857142]
[200,1500,1500,1273.3333333333333]
[200,1600,1600,1193.75]
[200,1700,1700,1123.5294117647059]
[200,1800,1800,1061.1111111111111]
[200,1900,1900,1005.2631578947369]
["Power (kW)","Engine LS","Power take-off (rpm)","(Nm)"]
[250,1100,{"$f":"B79*1","v":1100},{"$f":"A79*9550/C79","v":2170.4545454545455}]
[250,{"$f":"B79+100","v":1200},1200,1989.5833333333333]
[250,1300,1300,1836.5384615384614]
[250,1400,1400,1705.3571428571429]
[250,1500,1500,1591.6666666666667]
[250,1600,1600,1492.1875]
[250,1700,1700,1404.4117647058824]
[250,1800,1800,1326.3888888888889]
[250,1900,1900,1256.578947368421]
["Power (kW)","Engine HS","Power take-off (rpm)","(Nm)"]
[250,1100,1100,{"$f":"A89*9550/C89","v":2170.4545454545455}]
[250,{"$f":"B89+100","v":1200},1200,1989.5833333333333]
[250,1300,1300,1836.5384615384614]
[250,1400,1400,1705.3571428571429]
[250,1500,1500,1591.6666666666667]
[250,1600,1600,1492.1875]
[250,1700,1700,1404.4117647058824]
[250,1800,1800,1326.3888888888889]
[250,1900,1900,1256.578947368421]

{"sheet":"EK750F","index":8,"n_rows":31,"n_cols":4,"rows_kept":31,"cut":false,"hidden":false,"merged":[[0,0,0,3]]}
["EK750F"]
["Power (kW)","Engine LS","Power take-off (rpm)","(Nm)"]
[120,1100,{"$f":"B3*1","v":1100},{"$f":"A3*9550/C3","v":1041.8181818181818}]
[120,{"$f":"B3+100","v":1200},1200,955]
[120,1300,1300,881.53846153846155]
[120,1400,1400,818.57142857142856]
[120,1500,1500,764]
[120,1600,1600,716.25]
[120,1700,1700,674.11764705882354]
[120,1800,1800,636.66666666666663]
[120,1900,{"$f":"B11*1","v":1900},603.15789473684208]
["Power (kW)","Engine HS","Power take-off (rpm)","(Nm)"]
[120,1100,{"$f":"B13*1","v":1100},{"$f":"A13*9550/C13","v":1041.8181818181818}]
[120,{"$f":"B13+100","v":1200},1200,955]
[120,1300,1300,881.53846153846155]
[120,1400,1400,818.57142857142856]
[120,1500,1500,764]
[120,1600,1600,716.25]
[120,1700,1700,674.11764705882354]
[120,1800,1800,636.66666666666663]
[120,1900,{"$f":"B21*1","v":1900},603.15789473684208]
["Power (kW)","Engine LS","Power take-off (rpm)","(Nm)"]
[170,1600,{"$f":"B23*1","v":1600},{"$f":"A23*9550/C23","v":1014.6875}]
[170,{"$f":"B23+100","v":1700},1700,955]
[170,1800,1800,901.94444444444446]
[170,1900,1900,854.47368421052636]
["Power (kW)","Engine HS","Power take-off (rpm)","(Nm)"]
[170,1600,{"$f":"B28*1","v":1600},{"$f":"A28*9550/C28","v":1014.6875}]
[170,{"$f":"B28+100","v":1700},1700,955]
[170,1800,1800,901.94444444444446]
[170,1900,1900,854.47368421052636]

{"sheet":"EG730P","index":9,"n_rows":97,"n_cols":4,"rows_kept":97,"cut":false,"hidden":false,"merged":[[0,0,0,3]]}
["EG730P"]
["Power (kW)","Engine LS","Power take-off (rpm)","(Nm)"]
[120,800,{"$f":"B3*1","v":800},{"$f":"A3*9550/C3","v":1432.5}]
[120,{"$f":"B3+100","v":900},900,1273.3333333333333]
[120,1000,1000,1146]
[120,1100,1100,1041.8181818181818]
[120,1200,1200,955]
[120,1300,1300,881.53846153846155]
[120,1400,1400,818.57142857142856]
[120,1500,1500,764]
[120,1600,1600,716.25]
[120,1700,1700,674.11764705882354]
[120,1800,1800,636.66666666666663]
[120,1900,{"$f":"B14*1","v":1900},603.15789473684208]
["Power (kW)","Engine HS","Power take-off (rpm)","(Nm)"]
[120,800,{"$f":"B16*1","v":800},{"$f":"A16*9550/C16","v":1432.5}]
[120,{"$f":"B16+100","v":900},900,1273.3333333333333]
[120,1000,1000,1146]
[120,1100,1100,1041.8181818181818]
[120,1200,1200,955]
[120,1300,1300,881.53846153846155]
[120,1400,1400,818.57142857142856]
[120,1500,1500,764]
[120,1600,1600,716.25]
[120,1700,1700,674.11764705882354]
[120,1800,1800,636.66666666666663]
[120,1900,{"$f":"B27*1","v":1900},603.15789473684208]
["Power (kW)","Engine LS","Power take-off (rpm)","(Nm)"]
[170,800,{"$f":"B29*1","v":800},{"$f":"A29*9550/C29","v":2029.375}]
[170,{"$f":"B29+100","v":900},900,1803.8888888888889]
[170,1000,1000,1623.5]
[170,1100,1100,1475.909090909091]
[170,1200,1200,1352.9166666666667]
[170,1300,1300,1248.8461538461538]
[170,1400,1400,1159.6428571428571]
[170,1500,1500,1082.3333333333333]
[170,1600,1600,1014.6875]
[170,1700,1700,955]
[170,1800,1800,901.94444444444446]
[170,1900,1900,854.47368421052636]
["Power (kW)","Engine HS","Power take-off (rpm)","(Nm)"]
[170,800,{"$f":"B42*1","v":800},{"$f":"A42*9550/C42","v":2029.375}]
[170,{"$f":"B42+100","v":900},900,1803.8888888888889]
[170,1000,1000,1623.5]
[170,1100,1100,1475.909090909091]
[170,1200,1200,1352.9166666666667]
[170,1300,1300,1248.8461538461538]
[170,1400,1400,1159.6428571428571]
[170,1500,1500,1082.3333333333333]
[170,1600,1600,1014.6875]
[170,1700,1700,955]
[170,1800,1800,901.94444444444446]
[170,1900,1900,854.47368421052636]
["Power (kW)","Engine LS","Power take-off (rpm)","(Nm)"]
[200,900,{"$f":"B55*1","v":900},{"$f":"A55*9550/C55","v":2122.2222222222222}]
[200,{"$f":"B55+100","v":1000},1000,1910]
[200,1100,1100,1736.3636363636363]
[200,1200,1200,1591.6666666666667]
[200,1300,1300,1469.2307692307693]
[200,1400,1400,1364.2857142857142]
[200,1500,1500,1273.3333333333333]
[200,1600,1600,1193.75]
[200,1700,1700,1123.5294117647059]
[200,1800,1800,1061.1111111111111]
[200,1900,1900,1005.2631578947369]
["Power (kW)","Engine HS","Power take-off (rpm)","(Nm)"]
[200,900,{"$f":"B67*1","v":900},{"$f":"A67*9550/C67","v":2122.2222222222222}]
[200,{"$f":"B67+100","v":1000},1000,1910]
[200,1100,1100,1736.3636363636363]
[200,1200,1200,1591.6666666666667]
[200,1300,1300,1469.2307692307693]
[200,1400,1400,1364.2857142857142]
[200,1500,1500,1273.3333333333333]
[200,1600,1600,1193.75]
[200,1700,1700,1123.5294117647059]
[200,1800,1800,1061.1111111111111]
[200,1900,1900,1005.2631578947369]
["Power (kW)","Engine LS","Power take-off (rpm)","(Nm)"]
[250,1100,{"$f":"B79*1","v":1100},{"$f":"A79*9550/C79","v":2170.4545454545455}]
[250,{"$f":"B79+100","v":1200},1200,1989.5833333333333]
[250,1300,1300,1836.5384615384614]
[250,1400,1400,1705.3571428571429]
[250,1500,1500,1591.6666666666667]
[250,1600,1600,1492.1875]
[250,1700,1700,1404.4117647058824]
[250,1800,1800,1326.3888888888889]
[250,1900,1900,1256.578947368421]
["Power (kW)","Engine HS","Power take-off (rpm)","(Nm)"]
[250,1100,1100,{"$f":"A89*9550/C89","v":2170.4545454545455}]
[250,{"$f":"B89+100","v":1200},1200,1989.5833333333333]
[250,1300,1300,1836.5384615384614]
[250,1400,1400,1705.3571428571429]
[250,1500,1500,1591.6666666666667]
[250,1600,1600,1492.1875]
[250,1700,1700,1404.4117647058824]
[250,1800,1800,1326.3888888888889]
[250,1900,1900,1256.578947368421]

{"sheet":"EG740F","index":10,"n_rows":97,"n_cols":4,"rows_kept":97,"cut":false,"hidden":false,"merged":[[0,0,0,3]]}
["EG740F"]
["Power (kW)","Engine LS","Power take-off (rpm)","(Nm)"]
[120,800,{"$f":"B3*1","v":800},{"$f":"A3*9550/C3","v":1432.5}]
[120,{"$f":"B3+100","v":900},900,1273.3333333333333]
[120,1000,1000,1146]
[120,1100,1100,1041.8181818181818]
[120,1200,1200,955]
[120,1300,1300,{"$f":"A8*9550/C8","v":881.53846153846155}]
[120,1400,1400,818.57142857142856]
[120,1500,1500,764]
[120,1600,1600,716.25]
[120,1700,1700,674.11764705882354]
[120,1800,1800,636.66666666666663]
[120,1900,{"$f":"B14*1","v":1900},603.15789473684208]
["Power (kW)","Engine HS","Power take-off (rpm)","(Nm)"]
[120,800,{"$f":"B16*1","v":800},{"$f":"A16*9550/C16","v":1432.5}]
[120,{"$f":"B16+100","v":900},900,1273.3333333333333]
[120,1000,1000,1146]
[120,1100,1100,1041.8181818181818]
[120,1200,1200,955]
[120,1300,1300,881.53846153846155]
[120,1400,1400,818.57142857142856]
[120,1500,1500,764]
[120,1600,1600,716.25]
[120,1700,1700,674.11764705882354]
[120,1800,1800,636.66666666666663]
[120,1900,{"$f":"B27*1","v":1900},603.15789473684208]
["Power (kW)","Engine LS","Power take-off (rpm)","(Nm)"]
[170,800,{"$f":"B29*1","v":800},{"$f":"A29*9550/C29","v":2029.375}]
[170,{"$f":"B29+100","v":900},900,1803.8888888888889]
[170,1000,1000,1623.5]
[170,1100,1100,1475.909090909091]
[170,1200,1200,1352.9166666666667]
[170,1300,1300,1248.8461538461538]
[170,1400,1400,1159.6428571428571]
[170,1500,1500,1082.3333333333333]
[170,1600,1600,1014.6875]
[170,1700,1700,955]
[170,1800,1800,901.94444444444446]
[170,1900,1900,854.47368421052636]
["Power (kW)","Engine HS","Power take-off (rpm)","(Nm)"]
[170,800,{"$f":"B42*1","v":800},{"$f":"A42*9550/C42","v":2029.375}]
[170,{"$f":"B42+100","v":900},900,1803.8888888888889]
[170,1000,1000,1623.5]
[170,1100,1100,1475.909090909091]
[170,1200,1200,1352.9166666666667]
[170,1300,1300,1248.8461538461538]
[170,1400,1400,1159.6428571428571]
[170,1500,1500,1082.3333333333333]
[170,1600,1600,1014.6875]
[170,1700,1700,955]
[170,1800,1800,901.94444444444446]
[170,1900,1900,854.47368421052636]
["Power (kW)","Engine LS","Power take-off (rpm)","(Nm)"]
[200,900,{"$f":"B55*1","v":900},{"$f":"A55*9550/C55","v":2122.2222222222222}]
[200,{"$f":"B55+100","v":1000},1000,1910]
[200,1100,1100,1736.3636363636363]
[200,1200,1200,1591.6666666666667]
[200,1300,1300,1469.2307692307693]
[200,1400,1400,1364.2857142857142]
[200,1500,1500,1273.3333333333333]
[200,1600,1600,1193.75]
[200,1700,1700,1123.5294117647059]
[200,1800,1800,1061.1111111111111]
[200,1900,1900,1005.2631578947369]
["Power (kW)","Engine HS","Power take-off (rpm)","(Nm)"]
[200,900,{"$f":"B67*1","v":900},{"$f":"A67*9550/C67","v":2122.2222222222222}]
[200,{"$f":"B67+100","v":1000},1000,1910]
[200,1100,1100,1736.3636363636363]
[200,1200,1200,1591.6666666666667]
[200,1300,1300,1469.2307692307693]
[200,1400,1400,1364.2857142857142]
[200,1500,1500,1273.3333333333333]
[200,1600,1600,1193.75]
[200,1700,1700,1123.5294117647059]
[200,1800,1800,1061.1111111111111]
[200,1900,1900,1005.2631578947369]
["Power (kW)","Engine LS","Power take-off (rpm)","(Nm)"]
[250,1100,{"$f":"B79*1","v":1100},{"$f":"A79*9550/C79","v":2170.4545454545455}]
[250,{"$f":"B79+100","v":1200},1200,1989.5833333333333]
[250,1300,1300,1836.5384615384614]
[250,1400,1400,1705.3571428571429]
[250,1500,1500,1591.6666666666667]
[250,1600,1600,1492.1875]
[250,1700,1700,1404.4117647058824]
[250,1800,1800,1326.3888888888889]
[250,1900,1900,1256.578947368421]
["Power (kW)","Engine HS","Power take-off (rpm)","(Nm)"]
[250,1100,1100,{"$f":"A89*9550/C89","v":2170.4545454545455}]
[250,{"$f":"B89+100","v":1200},1200,1989.5833333333333]
[250,1300,1300,1836.5384615384614]
[250,1400,1400,1705.3571428571429]
[250,1500,1500,1591.6666666666667]
[250,1600,1600,1492.1875]
[250,1700,1700,1404.4117647058824]
[250,1800,1800,1326.3888888888889]
[250,1900,1900,1256.578947368421]

{"sheet":"EG500P","index":11,"n_rows":38,"n_cols":4,"rows_kept":38,"cut":false,"hidden":false,"merged":[[0,0,0,3]]}
["EG500P"]
["Power (kW)","Engine LS","Power take-off (rpm)","(Nm)"]
[60,1000,{"$f":"B3*1.33","v":1330},{"$f":"A3*9550/C3","v":430.82706766917295}]
[60,{"$f":"B3+100","v":1100},1463,391.66097060833903]
[60,1200,1596,359.02255639097746]
[60,1300,1729,331.40543666859458]
[60,1400,1862,307.73361976369495]
[60,1500,1995,287.21804511278197]
[60,1600,2128,269.26691729323306]
[60,1700,2261,253.42768686421937]
[60,1800,{"$f":"B11*1.33","v":2394},239.34837092731829]
[60,1900,2527,226.75108824693314]
["Power (kW)","Engine HS","Power take-off (rpm)","(Nm)"]
[60,800,{"$f":"B14*1.65","v":1320},{"$f":"A14*9550/C14","v":434.09090909090907}]
[60,{"$f":"B14+100","v":900},1485,385.85858585858585]
[60,1000,1650,347.27272727272725]
[60,1100,1815,315.70247933884298]
[60,1200,1980,289.39393939393938]
[60,1300,2145,267.13286713286715]
[60,1400,2310,248.05194805194805]
[60,1500,2475,231.5151515151515]
[60,1600,2640,217.04545454545453]
[60,1700,2805,204.27807486631016]
[60,1800,2970,192.92929292929293]
[60,1900,3135,182.77511961722487]
["Power (kW)","Engine LS","Power take-off (rpm)","(Nm)"]
[90,1600,{"$f":"B27*1.33","v":2128},{"$f":"A27*9550/C27","v":403.9003759398496}]
[90,{"$f":"B27+100","v":1700},2261,380.14153029632905]
[90,1800,2394,359.02255639097746]
[90,1900,2527,340.1266323703997]
["Power (kW)","Engine HS","Power take-off (rpm)","(Nm)"]
[90,1300,{"$f":"B32*1.65","v":2145},{"$f":"A32*9550/C32","v":400.69930069930069}]
[90,{"$f":"B32+100","v":1400},{"$f":"B33*1.65","v":2310},372.0779220779221]
[90,1500,2475,347.27272727272725]
[90,1600,2640,325.56818181818181]
[90,1700,2805,306.41711229946526]
[90,1800,2970,289.39393939393938]
[90,1900,3135,274.16267942583733]

{"sheet":"EG500F","index":12,"n_rows":38,"n_cols":4,"rows_kept":38,"cut":false,"hidden":false,"merged":[[0,0,0,3]]}
["EG500F"]
["Power (kW)","Engine LS","Power take-off (rpm)","(Nm)"]
[60,1000,{"$f":"B3*1.33","v":1330},{"$f":"A3*9550/C3","v":430.82706766917295}]
[60,{"$f":"B3+100","v":1100},1463,391.66097060833903]
[60,1200,1596,359.02255639097746]
[60,1300,1729,331.40543666859458]
[60,1400,1862,307.73361976369495]
[60,1500,1995,287.21804511278197]
[60,1600,2128,269.26691729323306]
[60,1700,2261,253.42768686421937]
[60,1800,{"$f":"B11*1.33","v":2394},239.34837092731829]
[60,1900,2527,226.75108824693314]
["Power (kW)","Engine HS","Power take-off (rpm)","(Nm)"]
[60,800,{"$f":"B14*1.65","v":1320},{"$f":"A14*9550/C14","v":434.09090909090907}]
[60,{"$f":"B14+100","v":900},1485,385.85858585858585]
[60,1000,1650,347.27272727272725]
[60,1100,1815,315.70247933884298]
[60,1200,1980,289.39393939393938]
[60,1300,2145,267.13286713286715]
[60,1400,2310,248.05194805194805]
[60,1500,2475,231.5151515151515]
[60,1600,2640,217.04545454545453]
[60,1700,2805,204.27807486631016]
[60,1800,2970,192.92929292929293]
[60,1900,3135,182.77511961722487]
["Power (kW)","Engine LS","Power take-off (rpm)","(Nm)"]
[90,1600,{"$f":"B27*1.33","v":2128},{"$f":"A27*9550/C27","v":403.9003759398496}]
[90,{"$f":"B27+100","v":1700},2261,380.14153029632905]
[90,1800,2394,359.02255639097746]
[90,1900,2527,340.1266323703997]
["Power (kW)","Engine HS","Power take-off (rpm)","(Nm)"]
[90,1300,{"$f":"B32*1.65","v":2145},{"$f":"A32*9550/C32","v":400.69930069930069}]
[90,{"$f":"B32+100","v":1400},{"$f":"B33*1.65","v":2310},372.0779220779221]
[90,1500,2475,347.27272727272725]
[90,1600,2640,325.56818181818181]
[90,1700,2805,306.41711229946526]
[90,1800,2970,289.39393939393938]
[90,1900,3135,274.16267942583733]

{"sheet":"EG502P","index":13,"n_rows":38,"n_cols":4,"rows_kept":38,"cut":false,"hidden":false,"merged":[[0,0,0,3]]}
["EG502P"]
["Power (kW)","Engine LS","Power take-off (rpm)","(Nm)"]
[60,1000,{"$f":"B3*1.33","v":1330},{"$f":"A3*9550/C3","v":430.82706766917295}]
[60,{"$f":"B3+100","v":1100},1463,391.66097060833903]
[60,1200,1596,359.02255639097746]
[60,1300,1729,331.40543666859458]
[60,1400,1862,307.73361976369495]
[60,1500,1995,287.21804511278197]
[60,1600,2128,269.26691729323306]
[60,1700,2261,253.42768686421937]
[60,1800,{"$f":"B11*1.33","v":2394},239.34837092731829]
[60,1900,2527,226.75108824693314]
["Power (kW)","Engine HS","Power take-off (rpm)","(Nm)"]
[60,800,{"$f":"B14*1.65","v":1320},{"$f":"A14*9550/C14","v":434.09090909090907}]
[60,{"$f":"B14+100","v":900},1485,385.85858585858585]
[60,1000,1650,347.27272727272725]
[60,1100,1815,315.70247933884298]
[60,1200,1980,289.39393939393938]
[60,1300,2145,267.13286713286715]
[60,1400,2310,248.05194805194805]
[60,1500,2475,231.5151515151515]
[60,1600,2640,217.04545454545453]
[60,1700,2805,204.27807486631016]
[60,1800,2970,192.92929292929293]
[60,1900,3135,182.77511961722487]
["Power (kW)","Engine LS","Power take-off (rpm)","(Nm)"]
[90,1600,{"$f":"B27*1.33","v":2128},{"$f":"A27*9550/C27","v":403.9003759398496}]
[90,{"$f":"B27+100","v":1700},2261,380.14153029632905]
[90,1800,2394,359.02255639097746]
[90,1900,2527,340.1266323703997]
["Power (kW)","Engine HS","Power take-off (rpm)","(Nm)"]
[90,1300,{"$f":"B32*1.65","v":2145},{"$f":"A32*9550/C32","v":400.69930069930069}]
[90,{"$f":"B32+100","v":1400},{"$f":"B33*1.65","v":2310},372.0779220779221]
[90,1500,2475,347.27272727272725]
[90,1600,2640,325.56818181818181]
[90,1700,2805,306.41711229946526]
[90,1800,2970,289.39393939393938]
[90,1900,3135,274.16267942583733]

{"sheet":"EG502F","index":14,"n_rows":38,"n_cols":4,"rows_kept":38,"cut":false,"hidden":false,"merged":[[0,0,0,3]]}
["EG500F"]
["Power (kW)","Engine LS","Power take-off (rpm)","(Nm)"]
[60,1000,{"$f":"B3*1.33","v":1330},{"$f":"A3*9550/C3","v":430.82706766917295}]
[60,{"$f":"B3+100","v":1100},1463,391.66097060833903]
[60,1200,1596,359.02255639097746]
[60,1300,1729,331.40543666859458]
[60,1400,1862,307.73361976369495]
[60,1500,1995,287.21804511278197]
[60,1600,2128,269.26691729323306]
[60,1700,2261,253.42768686421937]
[60,1800,{"$f":"B11*1.33","v":2394},239.34837092731829]
[60,1900,2527,226.75108824693314]
["Power (kW)","Engine HS","Power take-off (rpm)","(Nm)"]
[60,800,{"$f":"B14*1.65","v":1320},{"$f":"A14*9550/C14","v":434.09090909090907}]
[60,{"$f":"B14+100","v":900},1485,385.85858585858585]
[60,1000,1650,347.27272727272725]
[60,1100,1815,315.70247933884298]
[60,1200,1980,289.39393939393938]
[60,1300,2145,267.13286713286715]
[60,1400,2310,248.05194805194805]
[60,1500,2475,231.5151515151515]
[60,1600,2640,217.04545454545453]
[60,1700,2805,204.27807486631016]
[60,1800,2970,192.92929292929293]
[60,1900,3135,182.77511961722487]
["Power (kW)","Engine LS","Power take-off (rpm)","(Nm)"]
[90,1600,{"$f":"B27*1.33","v":2128},{"$f":"A27*9550/C27","v":403.9003759398496}]
[90,{"$f":"B27+100","v":1700},2261,380.14153029632905]
[90,1800,2394,359.02255639097746]
[90,1900,2527,340.1266323703997]
["Power (kW)","Engine HS","Power take-off (rpm)","(Nm)"]
[90,1300,{"$f":"B32*1.65","v":2145},{"$f":"A32*9550/C32","v":400.69930069930069}]
[90,{"$f":"B32+100","v":1400},{"$f":"B33*1.65","v":2310},372.0779220779221]
[90,1500,2475,347.27272727272725]
[90,1600,2640,325.56818181818181]
[90,1700,2805,306.41711229946526]
[90,1800,2970,289.39393939393938]
[90,1900,3135,274.16267942583733]

{"sheet":"EG501P","index":15,"n_rows":49,"n_cols":4,"rows_kept":49,"cut":false,"hidden":false,"merged":[[0,0,0,3]]}
["EG501P"]
["Power (kW)","Engine LS","Power take-off (rpm)","(Nm)"]
[60,800,{"$f":"B3*1.78","v":1424},{"$f":"A3*9550/C3","v":402.38764044943821}]
[60,900,{"$f":"B4*1.78","v":1602},357.67790262172286]
[60,{"$f":"B4+100","v":1000},{"$f":"B5*1.78","v":1780},321.91011235955057]
[60,1100,1958,292.64555669050048]
[60,1200,2136,268.25842696629212]
[60,1300,2314,247.62316335350044]
[60,1400,2492,229.93579454253612]
[60,1500,2670,214.6067415730337]
[60,1600,2848,201.1938202247191]
[60,1700,3026,189.35888962326504]
[60,1800,3204,178.83895131086143]
[60,1900,{"$f":"B14*1.78","v":3382},169.42637492607923]
["Power (kW)","Engine HS","Power take-off (rpm)","(Nm)"]
[60,800,{"$f":"B16*2.22","v":1776.0000000000002},{"$f":"A16*9550/C16","v":322.6351351351351}]
[60,{"$f":"B16+100","v":900},1998.0000000000002,286.78678678678676]
[60,1000,2220,258.10810810810813]
[60,1100,2442,234.64373464373463]
[60,1200,2664.0000000000005,215.09009009009006]
[60,1300,2886.0000000000005,198.54469854469852]
[60,1400,3108.0000000000005,184.36293436293434]
[60,1500,3330.0000000000005,172.07207207207205]
[60,1600,3552.0000000000005,161.31756756756755]
[60,1700,3774.0000000000005,151.8282988871224]
[60,1800,3996.0000000000005,143.39339339339338]
[60,1900,4218,135.84637268847794]
["Power (kW)","Engine LS","Power take-off (rpm)","(Nm)"]
[90,1200,{"$f":"B29*1.78","v":2136},{"$f":"A29*9550/C29","v":402.38764044943821}]
[90,1300,{"$f":"B30*1.78","v":2314},371.43474503025067]
[90,{"$f":"B30+100","v":1400},{"$f":"B31*1.78","v":2492},344.90369181380419]
[90,1500,2670,321.91011235955057]
[90,1600,2848,301.79073033707863]
[90,1700,3026,284.03833443489754]
[90,1800,3204,268.25842696629212]
[90,1900,{"$f":"B36*1.78","v":3382},254.13956238911885]
["Power (kW)","Engine HS","Power take-off (rpm)","(Nm)"]
[90,900,{"$f":"B38*2.22","v":1998.0000000000002},{"$f":"A38*9550/C38","v":430.18018018018012}]
[90,1000,{"$f":"B39*2.22","v":2220},387.16216216216219]
[90,1100,{"$f":"B40*2.22","v":2442},351.96560196560199]
[90,1100,{"$f":"B41*2.22","v":2442},351.96560196560199]
[90,1200,{"$f":"B42*2.22","v":2664.0000000000005},322.6351351351351]
[90,1300,2886.0000000000005,297.81704781704775]
[90,{"$f":"B43+100","v":1400},3108.0000000000005,276.54440154440152]
[90,1500,3330.0000000000005,258.10810810810807]
[90,1600,3552.0000000000005,241.97635135135133]
[90,1700,3774.0000000000005,227.7424483306836]
[90,1800,3996.0000000000005,215.09009009009006]
[90,1900,4218,203.76955903271693]

{"sheet":"EG501F","index":16,"n_rows":49,"n_cols":4,"rows_kept":49,"cut":false,"hidden":false,"merged":[[0,0,0,3]]}
["EG501F"]
["Power (kW)","Engine LS","Power take-off (rpm)","(Nm)"]
[60,800,{"$f":"B3*1.78","v":1424},{"$f":"A3*9550/C3","v":402.38764044943821}]
[60,900,{"$f":"B4*1.78","v":1602},357.67790262172286]
[60,{"$f":"B4+100","v":1000},{"$f":"B5*1.78","v":1780},321.91011235955057]
[60,1100,1958,292.64555669050048]
[60,1200,2136,268.25842696629212]
[60,1300,2314,247.62316335350044]
[60,1400,2492,229.93579454253612]
[60,1500,2670,214.6067415730337]
[60,1600,2848,201.1938202247191]
[60,1700,3026,189.35888962326504]
[60,1800,3204,178.83895131086143]
[60,1900,{"$f":"B14*1.78","v":3382},169.42637492607923]
["Power (kW)","Engine HS","Power take-off (rpm)","(Nm)"]
[60,800,{"$f":"B16*2.22","v":1776.0000000000002},{"$f":"A16*9550/C16","v":322.6351351351351}]
[60,{"$f":"B16+100","v":900},1998.0000000000002,286.78678678678676]
[60,1000,2220,258.10810810810813]
[60,1100,2442,234.64373464373463]
[60,1200,2664.0000000000005,215.09009009009006]
[60,1300,2886.0000000000005,198.54469854469852]
[60,1400,3108.0000000000005,184.36293436293434]
[60,1500,3330.0000000000005,172.07207207207205]
[60,1600,3552.0000000000005,161.31756756756755]
[60,1700,3774.0000000000005,151.8282988871224]
[60,1800,3996.0000000000005,143.39339339339338]
[60,1900,4218,135.84637268847794]
["Power (kW)","Engine LS","Power take-off (rpm)","(Nm)"]
[90,1200,{"$f":"B29*1.78","v":2136},{"$f":"A29*9550/C29","v":402.38764044943821}]
[90,1300,{"$f":"B30*1.78","v":2314},371.43474503025067]
[90,{"$f":"B30+100","v":1400},{"$f":"B31*1.78","v":2492},344.90369181380419]
[90,1500,2670,321.91011235955057]
[90,1600,2848,301.79073033707863]
[90,1700,3026,284.03833443489754]
[90,1800,3204,268.25842696629212]
[90,1900,{"$f":"B36*1.78","v":3382},254.13956238911885]
["Power (kW)","Engine HS","Power take-off (rpm)","(Nm)"]
[90,900,{"$f":"B38*2.22","v":1998.0000000000002},{"$f":"A38*9550/C38","v":430.18018018018012}]
[90,1000,{"$f":"B39*2.22","v":2220},387.16216216216219]
[90,1100,{"$f":"B40*2.22","v":2442},351.96560196560199]
[90,1100,{"$f":"B41*2.22","v":2442},351.96560196560199]
[90,1200,{"$f":"B42*2.22","v":2664.0000000000005},322.6351351351351]
[90,1300,2886.0000000000005,297.81704781704775]
[90,{"$f":"B43+100","v":1400},3108.0000000000005,276.54440154440152]
[90,1500,3330.0000000000005,258.10810810810807]
[90,1600,3552.0000000000005,241.97635135135133]
[90,1700,3774.0000000000005,227.7424483306836]
[90,1800,3996.0000000000005,215.09009009009006]
[90,1900,4218,203.76955903271693]

{"sheet":"EG503P","index":17,"n_rows":49,"n_cols":4,"rows_kept":49,"cut":false,"hidden":false,"merged":[[0,0,0,3]]}
["EG503P"]
["Power (kW)","Engine LS","Power take-off (rpm)","(Nm)"]
[60,800,{"$f":"B3*1.78","v":1424},{"$f":"A3*9550/C3","v":402.38764044943821}]
[60,900,{"$f":"B4*1.78","v":1602},357.67790262172286]
[60,{"$f":"B4+100","v":1000},{"$f":"B5*1.78","v":1780},321.91011235955057]
[60,1100,1958,292.64555669050048]
[60,1200,2136,268.25842696629212]
[60,1300,2314,247.62316335350044]
[60,1400,2492,229.93579454253612]
[60,1500,2670,214.6067415730337]
[60,1600,2848,201.1938202247191]
[60,1700,3026,189.35888962326504]
[60,1800,3204,178.83895131086143]
[60,1900,{"$f":"B14*1.78","v":3382},169.42637492607923]
["Power (kW)","Engine HS","Power take-off (rpm)","(Nm)"]
[60,800,{"$f":"B16*2.22","v":1776.0000000000002},{"$f":"A16*9550/C16","v":322.6351351351351}]
[60,{"$f":"B16+100","v":900},1998.0000000000002,286.78678678678676]
[60,1000,2220,258.10810810810813]
[60,1100,2442,234.64373464373463]
[60,1200,2664.0000000000005,215.09009009009006]
[60,1300,2886.0000000000005,198.54469854469852]
[60,1400,3108.0000000000005,184.36293436293434]
[60,1500,3330.0000000000005,172.07207207207205]
[60,1600,3552.0000000000005,161.31756756756755]
[60,1700,3774.0000000000005,151.8282988871224]
[60,1800,3996.0000000000005,143.39339339339338]
[60,1900,4218,135.84637268847794]
["Power (kW)","Engine LS","Power take-off (rpm)","(Nm)"]
[90,1200,{"$f":"B29*1.78","v":2136},{"$f":"A29*9550/C29","v":402.38764044943821}]
[90,1300,{"$f":"B30*1.78","v":2314},371.43474503025067]
[90,{"$f":"B30+100","v":1400},{"$f":"B31*1.78","v":2492},344.90369181380419]
[90,1500,2670,321.91011235955057]
[90,1600,2848,301.79073033707863]
[90,1700,3026,284.03833443489754]
[90,1800,3204,268.25842696629212]
[90,1900,{"$f":"B36*1.78","v":3382},254.13956238911885]
["Power (kW)","Engine HS","Power take-off (rpm)","(Nm)"]
[90,900,{"$f":"B38*2.22","v":1998.0000000000002},{"$f":"A38*9550/C38","v":430.18018018018012}]
[90,1000,{"$f":"B39*2.22","v":2220},387.16216216216219]
[90,1100,{"$f":"B40*2.22","v":2442},351.96560196560199]
[90,1100,{"$f":"B41*2.22","v":2442},351.96560196560199]
[90,1200,{"$f":"B42*2.22","v":2664.0000000000005},322.6351351351351]
[90,1300,2886.0000000000005,297.81704781704775]
[90,{"$f":"B43+100","v":1400},3108.0000000000005,276.54440154440152]
[90,1500,3330.0000000000005,258.10810810810807]
[90,1600,3552.0000000000005,241.97635135135133]
[90,1700,3774.0000000000005,227.7424483306836]
[90,1800,3996.0000000000005,215.09009009009006]
[90,1900,4218,203.76955903271693]

{"sheet":"EG503F","index":18,"n_rows":49,"n_cols":4,"rows_kept":49,"cut":false,"hidden":false,"merged":[[0,0,0,3]]}
["EG503F"]
["Power (kW)","Engine LS","Power take-off (rpm)","(Nm)"]
[60,800,{"$f":"B3*1.78","v":1424},{"$f":"A3*9550/C3","v":402.38764044943821}]
[60,900,{"$f":"B4*1.78","v":1602},357.67790262172286]
[60,{"$f":"B4+100","v":1000},{"$f":"B5*1.78","v":1780},321.91011235955057]
[60,1100,1958,292.64555669050048]
[60,1200,2136,268.25842696629212]
[60,1300,2314,247.62316335350044]
[60,1400,2492,229.93579454253612]
[60,1500,2670,214.6067415730337]
[60,1600,2848,201.1938202247191]
[60,1700,3026,189.35888962326504]
[60,1800,3204,178.83895131086143]
[60,1900,{"$f":"B14*1.78","v":3382},169.42637492607923]
["Power (kW)","Engine HS","Power take-off (rpm)","(Nm)"]
[60,800,{"$f":"B16*2.22","v":1776.0000000000002},{"$f":"A16*9550/C16","v":322.6351351351351}]
[60,{"$f":"B16+100","v":900},1998.0000000000002,286.78678678678676]
[60,1000,2220,258.10810810810813]
[60,1100,2442,234.64373464373463]
[60,1200,2664.0000000000005,215.09009009009006]
[60,1300,2886.0000000000005,198.54469854469852]
[60,1400,3108.0000000000005,184.36293436293434]
[60,1500,3330.0000000000005,172.07207207207205]
[60,1600,3552.0000000000005,161.31756756756755]
[60,1700,3774.0000000000005,151.8282988871224]
[60,1800,3996.0000000000005,143.39339339339338]
[60,1900,4218,135.84637268847794]
["Power (kW)","Engine LS","Power take-off (rpm)","(Nm)"]
[90,1200,{"$f":"B29*1.78","v":2136},{"$f":"A29*9550/C29","v":402.38764044943821}]
[90,1300,{"$f":"B30*1.78","v":2314},371.43474503025067]
[90,{"$f":"B30+100","v":1400},{"$f":"B31*1.78","v":2492},344.90369181380419]
[90,1500,2670,321.91011235955057]
[90,1600,2848,301.79073033707863]
[90,1700,3026,284.03833443489754]
[90,1800,3204,268.25842696629212]
[90,1900,{"$f":"B36*1.78","v":3382},254.13956238911885]
["Power (kW)","Engine HS","Power take-off (rpm)","(Nm)"]
[90,900,{"$f":"B38*2.22","v":1998.0000000000002},{"$f":"A38*9550/C38","v":430.18018018018012}]
[90,1000,{"$f":"B39*2.22","v":2220},387.16216216216219]
[90,1100,{"$f":"B40*2.22","v":2442},351.96560196560199]
[90,1100,{"$f":"B41*2.22","v":2442},351.96560196560199]
[90,1200,{"$f":"B42*2.22","v":2664.0000000000005},322.6351351351351]
[90,1300,2886.0000000000005,297.81704781704775]
[90,{"$f":"B43+100","v":1400},3108.0000000000005,276.54440154440152]
[90,1500,3330.0000000000005,258.10810810810807]
[90,1600,3552.0000000000005,241.97635135135133]
[90,1700,3774.0000000000005,227.7424483306836]
[90,1800,3996.0000000000005,215.09009009009006]
[90,1900,4218,203.76955903271693]

{"sheet":"EG640F","index":19,"n_rows":41,"n_cols":4,"rows_kept":41,"cut":false,"hidden":false,"merged":[[0,0,0,3]]}
["EG640F"]
["Power (kW)","Engine LS","Power take-off (rpm)","(Nm)"]
[70,900,{"$f":"B3*1.65","v":1485},{"$f":"A3*9550/C3","v":450.16835016835017}]
[70,{"$f":"B3+100","v":1000},1650,405.15151515151513]
[70,{"$f":"B4+100","v":1100},1815,368.31955922865012]
[70,1200,1980,337.62626262626264]
[70,1300,2145,311.65501165501166]
[70,1400,2310,289.39393939393938]
[70,1500,2475,270.1010101010101]
[70,1600,2640,253.21969696969697]
[70,1700,2805,238.32442067736184]
[70,1800,{"$f":"B12*1.65","v":2970},225.08417508417509]
[70,1900,3135,213.23763955342903]
["Power (kW)","Engine HS","Power take-off (rpm)","(Nm)"]
[70,800,{"$f":"B15*2.04","v":1632},{"$f":"A15*9550/C15","v":409.62009803921569}]
[70,{"$f":"B15+100","v":900},1836,364.10675381263616]
[70,1000,2040,327.69607843137254]
[70,1100,2244,297.90552584670229]
[70,1200,2448,273.08006535947715]
[70,1300,2652,252.07390648567119]
[70,1400,2856,234.06862745098039]
[70,1500,3060,218.46405228758169]
[70,1600,3264,204.81004901960785]
[70,1700,3468,192.76239907727796]
[70,1800,3672,182.05337690631808]
[70,1900,3876,172.47162022703819]
["Power (kW)","Engine LS","Power take-off (rpm)","(Nm)"]
[100,1300,{"$f":"B28*1.65","v":2145},{"$f":"A28*9550/C28","v":445.22144522144521}]
[100,{"$f":"B28+100","v":1400},2310,413.41991341991343]
[100,{"$f":"B29+100","v":1500},2475,385.85858585858585]
[100,1600,2640,361.74242424242425]
[100,1700,2805,340.46345811051691]
[100,1800,2970,321.54882154882154]
[100,1900,3135,304.62519936204149]
["Power (kW)","Engine HS","Power take-off (rpm)","(Nm)"]
[100,1400,{"$f":"B36*1.58","v":2212},{"$f":"A36*9550/C36","v":431.73598553345391}]
[100,{"$f":"B36+100","v":1500},2370,402.95358649789029]
[100,{"$f":"B37+100","v":1600},2528,377.76898734177217]
[100,1700,2686,355.54728220402086]
[100,1800,2844,335.79465541490856]
[100,1900,3002,318.12125249833446]

{"sheet":"EG640P","index":20,"n_rows":41,"n_cols":4,"rows_kept":41,"cut":false,"hidden":false,"merged":[[0,0,0,3]]}
["EG640P"]
["Power (kW)","Engine LS","Power take-off (rpm)","(Nm)"]
[70,900,{"$f":"B3*1.65","v":1485},{"$f":"A3*9550/C3","v":450.16835016835017}]
[70,{"$f":"B3+100","v":1000},1650,405.15151515151513]
[70,1100,1815,368.31955922865012]
[70,1200,1980,337.62626262626264]
[70,1300,2145,311.65501165501166]
[70,1400,2310,289.39393939393938]
[70,1500,2475,270.1010101010101]
[70,1600,2640,253.21969696969697]
[70,1700,2805,238.32442067736184]
[70,1800,{"$f":"B12*1.65","v":2970},225.08417508417509]
[70,1900,3135,213.23763955342903]
["Power (kW)","Engine HS","Power take-off (rpm)","(Nm)"]
[70,800,{"$f":"B15*2.04","v":1632},{"$f":"A15*9550/C15","v":409.62009803921569}]
[70,{"$f":"B15+100","v":900},1836,364.10675381263616]
[70,1000,2040,327.69607843137254]
[70,1100,2244,297.90552584670229]
[70,1200,2448,273.08006535947715]
[70,1300,2652,252.07390648567119]
[70,1400,2856,234.06862745098039]
[70,1500,3060,218.46405228758169]
[70,1600,3264,204.81004901960785]
[70,1700,3468,192.76239907727796]
[70,1800,3672,182.05337690631808]
[70,1900,3876,172.47162022703819]
["Power (kW)","Engine LS","Power take-off (rpm)","(Nm)"]
[100,1300,{"$f":"B28*1.65","v":2145},{"$f":"A28*9550/C28","v":445.22144522144521}]
[100,{"$f":"B28+100","v":1400},2310,413.41991341991343]
[100,1500,2475,385.85858585858585]
[100,1600,2640,361.74242424242425]
[100,1700,2805,340.46345811051691]
[100,1800,2970,321.54882154882154]
[100,1900,3135,304.62519936204149]
["Power (kW)","Engine HS","Power take-off (rpm)","(Nm)"]
[100,1400,{"$f":"B36*1.58","v":2212},{"$f":"A36*9550/C36","v":431.73598553345391}]
[100,{"$f":"B36+100","v":1500},2370,402.95358649789029]
[100,1600,2528,377.76898734177217]
[100,1700,2686,355.54728220402086]
[100,1800,2844,335.79465541490856]
[100,1900,3002,318.12125249833446]

{"sheet":"EG641P","index":21,"n_rows":36,"n_cols":4,"rows_kept":36,"cut":false,"hidden":false,"merged":[[0,0,0,3]]}
["EG641P"]
["Power (kW)","Engine LS","Power take-off (rpm)","(Nm)"]
[70,1100,{"$f":"B3*1.33","v":1463},{"$f":"A3*9550/C3","v":456.93779904306223}]
[70,{"$f":"B3+100","v":1200},{"$f":"B4*1.33","v":1596},418.85964912280701]
[70,{"$f":"B4+100","v":1300},1729,386.63967611336034]
[70,1400,1862,359.02255639097746]
[70,1500,1995,335.08771929824559]
[70,1600,2128,314.14473684210526]
[70,1700,2261,295.66563467492261]
[70,1800,2394,279.23976608187132]
[70,1900,2527,264.54293628808864]
["Power (kW)","Engine HS","Power take-off (rpm)","(Nm)"]
[70,900,{"$f":"B13*1.67","v":1503},{"$f":"A13*9550/C13","v":444.77711244178312}]
[70,{"$f":"B13+100","v":1000},1670,400.29940119760477]
[70,{"$f":"B14+100","v":1100},1837,363.90854654327705]
[70,1200,2004,333.58283433133732]
[70,1300,{"$f":"B17*1.67","v":2171},307.92261630584983]
[70,1400,2338,285.92814371257487]
[70,1500,2505,266.86626746506988]
[70,1600,2672,250.18712574850301]
[70,1700,{"$f":"B21*1.67","v":2839},235.47023599859105]
[70,1800,{"$f":"B22*1.67","v":3006},222.38855622089156]
[70,1900,{"$f":"B23*1.67","v":3173},210.6838953671604]
["Power (kW)","Engine LS","Power take-off (rpm)","(Nm)"]
[100,1600,{"$f":"B25*1.33","v":2128},{"$f":"A25*9550/C25","v":448.77819548872179}]
[100,{"$f":"B25+100","v":1700},2261,422.3794781070323]
[100,{"$f":"B26+100","v":1800},2394,398.91395154553049]
[100,1900,{"$f":"B28*1.33","v":2527},377.91848041155521]
["Power (kW)","Engine HS","Power take-off (rpm)","(Nm)"]
[100,1300,{"$f":"B30*1.67","v":2171},{"$f":"A30*9550/C30","v":439.88945186549978}]
[100,{"$f":"B30+100","v":1400},{"$f":"B31*1.67","v":2338},408.46877673224981]
[100,1500,2505,381.23752495009978]
[100,1600,2672,357.41017964071858]
[100,1700,2839,336.38605142655865]
[100,1800,3006,317.6979374584165]
[100,1900,{"$f":"B36*1.67","v":3173},300.97699338165773]

{"sheet":"EG641F","index":22,"n_rows":36,"n_cols":4,"rows_kept":36,"cut":false,"hidden":false,"merged":[[0,0,0,3]]}
["EG641F"]
["Power (kW)","Engine LS","Power take-off (rpm)","(Nm)"]
[70,1100,{"$f":"B3*1.33","v":1463},{"$f":"A3*9550/C3","v":456.93779904306223}]
[70,{"$f":"B3+100","v":1200},{"$f":"B4*1.33","v":1596},418.85964912280701]
[70,{"$f":"B4+100","v":1300},1729,386.63967611336034]
[70,1400,1862,359.02255639097746]
[70,1500,1995,335.08771929824559]
[70,1600,2128,314.14473684210526]
[70,1700,2261,295.66563467492261]
[70,1800,{"$f":"B10*1.33","v":2394},279.23976608187132]
[70,1900,2527,264.54293628808864]
["Power (kW)","Engine HS","Power take-off (rpm)","(Nm)"]
[70,900,{"$f":"B13*1.67","v":1503},{"$f":"A13*9550/C13","v":444.77711244178312}]
[70,{"$f":"B13+100","v":1000},{"$f":"B14*1.67","v":1670},400.29940119760477]
[70,{"$f":"B14+100","v":1100},1837,363.90854654327705]
[70,1200,2004,333.58283433133732]
[70,1300,{"$f":"B17*1.67","v":2171},307.92261630584983]
[70,1400,2338,285.92814371257487]
[70,1500,2505,266.86626746506988]
[70,1600,2672,250.18712574850301]
[70,1700,{"$f":"B21*1.67","v":2839},235.47023599859105]
[70,1800,{"$f":"B22*1.67","v":3006},222.38855622089156]
[70,1900,{"$f":"B23*1.67","v":3173},210.6838953671604]
["Power (kW)","Engine LS","Power take-off (rpm)","(Nm)"]
[100,1600,{"$f":"B25*1.33","v":2128},{"$f":"A25*9550/C25","v":448.77819548872179}]
[100,{"$f":"B25+100","v":1700},2261,422.3794781070323]
[100,{"$f":"B26+100","v":1800},2394,398.91395154553049]
[100,1900,{"$f":"B28*1.33","v":2527},377.91848041155521]
["Power (kW)","Engine HS","Power take-off (rpm)","(Nm)"]
[100,1300,{"$f":"B30*1.67","v":2171},{"$f":"A30*9550/C30","v":439.88945186549978}]
[100,{"$f":"B30+100","v":1400},{"$f":"B31*1.67","v":2338},408.46877673224981]
[100,1500,2505,381.23752495009978]
[100,1600,2672,357.41017964071858]
[100,1700,2839,336.38605142655865]
[100,1800,3006,317.6979374584165]
[100,1900,{"$f":"B36*1.67","v":3173},300.97699338165773]

{"sheet":"EG642P","index":23,"n_rows":34,"n_cols":4,"rows_kept":34,"cut":false,"hidden":false,"merged":[[0,0,0,3]]}
["EG642P"]
["Power (kW)","Engine LS","Power take-off (rpm)","(Nm)"]
[70,1200,{"$f":"B3*1.29","v":1548},{"$f":"A3*9550/C3","v":431.84754521963822}]
[70,{"$f":"B3+100","v":1300},{"$f":"B4*1.29","v":1677},398.62850327966606]
[70,1400,1806,370.15503875968994]
[70,1500,1935,345.4780361757106]
[70,1600,2064,323.88565891472871]
[70,1700,2193,304.83356133150937]
[70,1800,2322,287.89836347975881]
[70,1900,{"$f":"B10*1.29","v":2451},272.74581803345575]
["Power (kW)","Engine HS","Power take-off (rpm)","(Nm)"]
[70,900,{"$f":"B12*1.6","v":1440},{"$f":"A12*9550/C12","v":464.23611111111109}]
[70,{"$f":"B12+100","v":1000},{"$f":"B13*1.6","v":1600},417.8125]
[70,{"$f":"B13+100","v":1100},1760,379.82954545454544]
[70,1200,1920,348.17708333333331]
[70,1300,2080,321.39423076923077]
[70,1400,2240,298.4375]
[70,1500,2400,278.54166666666669]
[70,1600,2560,261.1328125]
[70,1700,2720,245.77205882352942]
[70,1800,{"$f":"B21*1.6","v":2880},232.11805555555554]
[70,1900,3040,219.90131578947367]
["Power (kW)","Engine LS","Power take-off (rpm)","(Nm)"]
[100,1700,{"$f":"B24*1.29","v":2193},{"$f":"A24*9550/C24","v":435.47651618787052}]
[100,{"$f":"B24+100","v":1800},2322,411.28337639965548]
[100,1900,{"$f":"B26*1.29","v":2451},389.63688290493678]
["Power (kW)","Engine HS","Power take-off (rpm)","(Nm)"]
[100,1300,{"$f":"B28*1.6","v":2080},{"$f":"A28*9550/C28","v":459.13461538461536}]
[100,{"$f":"B28+100","v":1400},{"$f":"B29*1.6","v":2240},426.33928571428572]
[100,1500,2400,397.91666666666669]
[100,1600,{"$f":"B31*1.6","v":2560},373.046875]
[100,1700,2720,351.10294117647061]
[100,1800,2880,331.59722222222223]
[100,1900,3040,314.14473684210526]

{"sheet":"EG642F","index":24,"n_rows":34,"n_cols":4,"rows_kept":34,"cut":false,"hidden":false,"merged":[[0,0,0,3]]}
["EG642F"]
["Power (kW)","Engine LS","Power take-off (rpm)","(Nm)"]
[70,1200,{"$f":"B3*1.29","v":1548},{"$f":"A3*9550/C3","v":431.84754521963822}]
[70,{"$f":"B3+100","v":1300},{"$f":"B4*1.29","v":1677},398.62850327966606]
[70,1400,1806,370.15503875968994]
[70,1500,1935,345.4780361757106]
[70,1600,2064,323.88565891472871]
[70,1700,2193,304.83356133150937]
[70,1800,2322,287.89836347975881]
[70,1900,{"$f":"B10*1.29","v":2451},272.74581803345575]
["Power (kW)","Engine HS","Power take-off (rpm)","(Nm)"]
[70,900,{"$f":"B12*1.6","v":1440},{"$f":"A12*9550/C12","v":464.23611111111109}]
[70,{"$f":"B12+100","v":1000},{"$f":"B13*1.6","v":1600},417.8125]
[70,{"$f":"B13+100","v":1100},1760,379.82954545454544]
[70,1200,1920,348.17708333333331]
[70,1300,2080,321.39423076923077]
[70,1400,2240,298.4375]
[70,1500,2400,278.54166666666669]
[70,1600,2560,261.1328125]
[70,1700,2720,245.77205882352942]
[70,1800,{"$f":"B21*1.6","v":2880},232.11805555555554]
[70,1900,3040,219.90131578947367]
["Power (kW)","Engine LS","Power take-off (rpm)","(Nm)"]
[100,1700,{"$f":"B24*1.29","v":2193},{"$f":"A24*9550/C24","v":435.47651618787052}]
[100,{"$f":"B24+100","v":1800},2322,411.28337639965548]
[100,1900,{"$f":"B26*1.29","v":2451},389.63688290493678]
["Power (kW)","Engine HS","Power take-off (rpm)","(Nm)"]
[100,1300,{"$f":"B28*1.6","v":2080},{"$f":"A28*9550/C28","v":459.13461538461536}]
[100,{"$f":"B28+100","v":1400},{"$f":"B29*1.6","v":2240},426.33928571428572]
[100,1500,2400,397.91666666666669]
[100,1600,{"$f":"B31*1.6","v":2560},373.046875]
[100,1700,2720,351.10294117647061]
[100,1800,2880,331.59722222222223]
[100,1900,3040,314.14473684210526]

{"sheet":"EG643P","index":25,"n_rows":24,"n_cols":5,"rows_kept":24,"cut":false,"hidden":false,"merged":[[0,0,0,3]]}
["EG643P"]
["Power (kW)","Engine LS","Power take-off (rpm)","(Nm)"]
[70,1400,{"$f":"B3*1.06","v":1484},{"$f":"A3*9550/C3","v":450.47169811320754}]
[70,{"$f":"B3+100","v":1500},1590,420.44025157232704]
[70,1600,1696,394.16273584905662]
[70,1700,1802,370.97669256381801]
[70,1800,1908,350.36687631027252]
[70,1900,{"$f":"B8*1.06","v":2014},331.92651439920559]
["Power (kW)","Engine HS","Power take-off (rpm)","(Nm)"]
[70,1100,{"$f":"B10*1.33","v":1463},{"$f":"A10*9550/C10","v":456.93779904306223}]
[70,{"$f":"B10+100","v":1200},1596,418.85964912280701]
[70,1300,1729,386.63967611336034]
[70,1400,1862,359.02255639097746]
[70,1500,1995,335.08771929824559]
[70,1600,{"$f":"B15*1.33","v":2128},314.14473684210526]
[70,1700,2261,295.66563467492261]
[70,1800,2394,279.23976608187132]
[70,1900,2527,264.54293628808864]
["Power (kW)","Engine LS","Power take-off (rpm)","(Nm)","No power line with LS"]
["Power (kW)","Engine HS","Power take-off (rpm)","(Nm)"]
[100,1600,{"$f":"B21*1.33","v":2128},{"$f":"A21*9550/C21","v":448.77819548872179}]
[100,{"$f":"B21+100","v":1700},2261,422.3794781070323]
[100,1800,2394,398.91395154553049]
[100,1900,{"$f":"B24*1.33","v":2527},377.91848041155521]

{"sheet":"EG643F","index":26,"n_rows":24,"n_cols":5,"rows_kept":24,"cut":false,"hidden":false,"merged":[[0,0,0,3]]}
["EG643F"]
["Power (kW)","Engine LS","Power take-off (rpm)","(Nm)"]
[70,1400,{"$f":"B3*1.06","v":1484},{"$f":"A3*9550/C3","v":450.47169811320754}]
[70,{"$f":"B3+100","v":1500},{"$f":"B4*1.06","v":1590},420.44025157232704]
[70,1600,1696,394.16273584905662]
[70,1700,1802,370.97669256381801]
[70,1800,1908,350.36687631027252]
[70,1900,{"$f":"B8*1.06","v":2014},331.92651439920559]
["Power (kW)","Engine HS","Power take-off (rpm)","(Nm)"]
[70,1100,{"$f":"B10*1.33","v":1463},{"$f":"A10*9550/C10","v":456.93779904306223}]
[70,{"$f":"B10+100","v":1200},{"$f":"B11*1.33","v":1596},418.85964912280701]
[70,1300,1729,386.63967611336034]
[70,1400,1862,359.02255639097746]
[70,1500,1995,335.08771929824559]
[70,1600,{"$f":"B15*1.33","v":2128},314.14473684210526]
[70,1700,2261,295.66563467492261]
[70,1800,2394,279.23976608187132]
[70,1900,2527,264.54293628808864]
["Power (kW)","Engine LS","Power take-off (rpm)","(Nm)","No power line with LS"]
["Power (kW)","Engine HS","Power take-off (rpm)","(Nm)"]
[100,1600,{"$f":"B21*1.33","v":2128},{"$f":"A21*9550/C21","v":448.77819548872179}]
[100,{"$f":"B21+100","v":1700},2261,422.3794781070323]
[100,1800,2394,398.91395154553049]
[100,1900,{"$f":"B24*1.33","v":2527},377.91848041155521]

{"sheet":"EG644P","index":27,"n_rows":26,"n_cols":4,"rows_kept":26,"cut":false,"hidden":false,"merged":[[0,0,0,3]]}
["EG644P"]
["Power (kW)","Engine LS","Power take-off (rpm)","(Nm)"]
[120,900,{"$f":"B3*1.48","v":1332},{"$f":"A3*9550/C3","v":860.36036036036035}]
[120,1000,{"$f":"B4*1.48","v":1480},774.32432432432438]
[120,1100,1628,703.93120393120398]
[120,1200,{"$f":"B6*1.48","v":1776},645.27027027027032]
[120,{"$f":"B6+100","v":1300},{"$f":"B7*1.48","v":1924},595.63409563409562]
[120,1400,2072,553.08880308880305]
[120,1500,2220,516.21621621621625]
[120,1600,2368,483.95270270270271]
[120,1700,2516,455.48489666136726]
[120,1800,2664,430.18018018018017]
[120,1900,2812,407.53911806543385]
["Power (kW)","Engine HS","Power take-off (rpm)","(Nm)"]
[120,800,{"$f":"B15*1.83","v":1464},{"$f":"A15*9550/C15","v":782.78688524590166}]
[120,900,{"$f":"B16*1.83","v":1647},695.81056466302368]
[120,{"$f":"B16+100","v":1000},{"$f":"B17*1.83","v":1830},626.22950819672133]
[120,{"$f":"B17+100","v":1100},2013,569.29955290611031]
[120,1200,2196,521.85792349726773]
[120,1300,2379,481.71500630517022]
[120,1400,2562,447.30679156908667]
[120,1500,2745,417.4863387978142]
[120,1600,2928,391.39344262295083]
[120,1700,3111,368.37029893924785]
[120,1800,3294,347.90528233151184]
[120,1900,{"$f":"B26*1.83","v":3477},329.59447799827439]

{"sheet":"EG644F","index":28,"n_rows":26,"n_cols":4,"rows_kept":26,"cut":false,"hidden":false,"merged":[[0,0,0,3]]}
["EG644F"]
["Power (kW)","Engine LS","Power take-off (rpm)","(Nm)"]
[120,900,{"$f":"B3*1.48","v":1332},{"$f":"A3*9550/C3","v":860.36036036036035}]
[120,1000,{"$f":"B4*1.48","v":1480},774.32432432432438]
[120,1100,1628,703.93120393120398]
[120,1200,{"$f":"B6*1.48","v":1776},645.27027027027032]
[120,{"$f":"B6+100","v":1300},{"$f":"B7*1.48","v":1924},595.63409563409562]
[120,1400,2072,553.08880308880305]
[120,1500,2220,516.21621621621625]
[120,1600,2368,483.95270270270271]
[120,1700,2516,455.48489666136726]
[120,1800,2664,430.18018018018017]
[120,1900,2812,407.53911806543385]
["Power (kW)","Engine HS","Power take-off (rpm)","(Nm)"]
[120,800,{"$f":"B15*1.83","v":1464},{"$f":"A15*9550/C15","v":782.78688524590166}]
[120,900,{"$f":"B16*1.83","v":1647},695.81056466302368]
[120,{"$f":"B16+100","v":1000},{"$f":"B17*1.83","v":1830},626.22950819672133]
[120,{"$f":"B17+100","v":1100},2013,569.29955290611031]
[120,1200,2196,521.85792349726773]
[120,1300,2379,481.71500630517022]
[120,1400,2562,447.30679156908667]
[120,1500,2745,417.4863387978142]
[120,1600,2928,391.39344262295083]
[120,1700,3111,368.37029893924785]
[120,1800,3294,347.90528233151184]
[120,1900,{"$f":"B26*1.83","v":3477},329.59447799827439]

{"sheet":"EG645P","index":29,"n_rows":25,"n_cols":4,"rows_kept":25,"cut":false,"hidden":false,"merged":[[0,0,0,3]]}
["EG645P"]
["Power (kW)","Engine LS","Power take-off (rpm)","(Nm)"]
[120,1000,{"$f":"B3*1.89","v":1890},{"$f":"A3*9550/C3","v":606.34920634920638}]
[120,1100,2079,551.22655122655124]
[120,1200,2268,505.29100529100526]
[120,{"$f":"B5+100","v":1300},2457,466.42246642246641]
[120,1400,2646,433.1065759637188]
[120,1500,2835,404.23280423280426]
[120,1600,3024,378.96825396825398]
[120,1700,3213,356.67600373482725]
[120,1800,3402,336.86067019400355]
[120,1900,{"$f":"B12*1.89","v":3591},319.13116123642442]
["Power (kW)","Engine HS","Power take-off (rpm)","(Nm)"]
[120,800,{"$f":"B14*2.34","v":1872},{"$f":"A14*9550/C14","v":612.17948717948718}]
[120,900,{"$f":"B15*2.34","v":2106},544.15954415954411]
[120,{"$f":"B15+100","v":1000},2340,489.74358974358972]
[120,{"$f":"B16+100","v":1100},2574,445.22144522144521]
[120,1200,2808,408.11965811965814]
[120,1300,3042,376.7258382642998]
[120,1400,3276,349.81684981684981]
[120,1500,3510,326.4957264957265]
[120,1600,3744,306.08974358974359]
[120,1700,3977.9999999999995,288.08446455505282]
[120,1800,4212,272.07977207977206]
[120,1900,4446,257.75978407557358]

{"sheet":"EG645F","index":30,"n_rows":25,"n_cols":4,"rows_kept":25,"cut":false,"hidden":false,"merged":[[0,0,0,3]]}
["EG645F"]
["Power (kW)","Engine LS","Power take-off (rpm)","(Nm)"]
[120,1000,{"$f":"B3*1.89","v":1890},{"$f":"A3*9550/C3","v":606.34920634920638}]
[120,1100,2079,551.22655122655124]
[120,1200,2268,505.29100529100526]
[120,{"$f":"B5+100","v":1300},2457,466.42246642246641]
[120,1400,2646,433.1065759637188]
[120,1500,2835,404.23280423280426]
[120,1600,3024,378.96825396825398]
[120,1700,3213,356.67600373482725]
[120,1800,3402,336.86067019400355]
[120,1900,{"$f":"B12*1.89","v":3591},319.13116123642442]
["Power (kW)","Engine HS","Power take-off (rpm)","(Nm)"]
[120,800,{"$f":"B14*2.34","v":1872},{"$f":"A14*9550/C14","v":612.17948717948718}]
[120,900,{"$f":"B15*2.34","v":2106},544.15954415954411]
[120,{"$f":"B15+100","v":1000},2340,489.74358974358972]
[120,{"$f":"B16+100","v":1100},{"$f":"B17*2.34","v":2574},445.22144522144521]
[120,1200,2808,408.11965811965814]
[120,1300,3042,376.7258382642998]
[120,1400,3276,349.81684981684981]
[120,1500,3510,326.4957264957265]
[120,1600,3744,306.08974358974359]
[120,1700,3977.9999999999995,288.08446455505282]
[120,1800,4212,272.07977207977206]
[120,1900,4446,257.75978407557358]

{"sheet":"EG646P","index":31,"n_rows":23,"n_cols":4,"rows_kept":23,"cut":false,"hidden":false,"merged":[[0,0,0,3]]}
["EG646P"]
["Power (kW)","Engine LS","Power take-off (rpm)","(Nm)"]
[120,1100,{"$f":"B3*1.21","v":1331},{"$f":"A3*9550/C3","v":861.00676183320809}]
[120,1200,{"$f":"B4*1.21","v":1452},789.25619834710744]
[120,{"$f":"B4+100","v":1300},1573,728.54418308963761]
[120,1400,1694,676.5053128689492]
[120,1500,1815,631.40495867768595]
[120,1600,1936,591.94214876033061]
[120,1700,2057,557.1220223626641]
[120,1800,2178,526.17079889807167]
[120,1900,{"$f":"B11*1.21","v":2299},498.47759895606788]
["Power (kW)","Engine HS","Power take-off (rpm)","(Nm)"]
[120,900,{"$f":"B13*1.52","v":1368},{"$f":"A13*9550/C13","v":837.71929824561403}]
[120,{"$f":"B13+100","v":1000},1520,753.9473684210526]
[120,{"$f":"B14+100","v":1100},1672,685.40669856459328]
[120,1200,1824,628.28947368421052]
[120,1300,1976,579.95951417004051]
[120,1400,2128,538.53383458646613]
[120,1500,2280,502.63157894736844]
[120,1600,2432,471.21710526315792]
[120,1700,2584,443.49845201238389]
[120,1800,2736,418.85964912280701]
[120,1900,{"$f":"B23*1.52","v":2888},396.81440443213296]

{"sheet":"EG646F","index":32,"n_rows":23,"n_cols":4,"rows_kept":23,"cut":false,"hidden":false,"merged":[[0,0,0,3]]}
["EG646F"]
["Power (kW)","Engine LS","Power take-off (rpm)","(Nm)"]
[120,1100,{"$f":"B3*1.21","v":1331},{"$f":"A3*9550/C3","v":861.00676183320809}]
[120,1200,{"$f":"B4*1.21","v":1452},789.25619834710744]
[120,{"$f":"B4+100","v":1300},1573,728.54418308963761]
[120,1400,1694,676.5053128689492]
[120,1500,1815,631.40495867768595]
[120,1600,1936,591.94214876033061]
[120,1700,2057,557.1220223626641]
[120,1800,2178,526.17079889807167]
[120,1900,{"$f":"B11*1.21","v":2299},498.47759895606788]
["Power (kW)","Engine HS","Power take-off (rpm)","(Nm)"]
[120,900,{"$f":"B13*1.52","v":1368},{"$f":"A13*9550/C13","v":837.71929824561403}]
[120,{"$f":"B13+100","v":1000},1520,753.9473684210526]
[120,{"$f":"B14+100","v":1100},1672,685.40669856459328]
[120,1200,1824,628.28947368421052]
[120,1300,{"$f":"B17*1.52","v":1976},579.95951417004051]
[120,1400,2128,538.53383458646613]
[120,1500,2280,502.63157894736844]
[120,1600,2432,471.21710526315792]
[120,1700,2584,443.49845201238389]
[120,1800,2736,418.85964912280701]
[120,1900,{"$f":"B23*1.52","v":2888},396.81440443213296]

{"sheet":"EG647P","index":33,"n_rows":21,"n_cols":4,"rows_kept":21,"cut":false,"hidden":false,"merged":[[0,0,0,3]]}
["EG647P"]
["Power (kW)","Engine LS","Power take-off (rpm)","(Nm)"]
[120,1200,{"$f":"B3*1.53","v":1836},{"$f":"A3*9550/C3","v":624.1830065359477}]
[120,{"$f":"B3+100","v":1300},1989,576.16892911010564]
[120,1400,2142,535.0140056022409]
[120,1500,2295,499.34640522875816]
[120,1600,2448,468.13725490196077]
[120,1700,2601,440.59976931949251]
[120,1800,{"$f":"B9*1.53","v":2754},416.12200435729847]
[120,1900,2907,394.22084623323013]
["Power (kW)","Engine HS","Power take-off (rpm)","(Nm)"]
[120,1000,{"$f":"B12*1.91","v":1910},{"$f":"A12*9550/C12","v":600}]
[120,{"$f":"B12+100","v":1100},{"$f":"B13*1.91","v":2101},545.4545454545455]
[120,1200,2292,500]
[120,1300,2483,461.53846153846155]
[120,1400,2674,428.57142857142856]
[120,1500,2865,400]
[120,1600,3056,375]
[120,1700,3247,352.94117647058823]
[120,1800,3438,333.33333333333331]
[120,1900,3629,315.78947368421052]

{"sheet":"EG647F","index":34,"n_rows":21,"n_cols":4,"rows_kept":21,"cut":false,"hidden":false,"merged":[[0,0,0,3]]}
["EG647F"]
["Power (kW)","Engine LS","Power take-off (rpm)","(Nm)"]
[120,1200,{"$f":"B3*1.53","v":1836},{"$f":"A3*9550/C3","v":624.1830065359477}]
[120,{"$f":"B3+100","v":1300},1989,576.16892911010564]
[120,1400,2142,535.0140056022409]
[120,1500,2295,499.34640522875816]
[120,1600,2448,468.13725490196077]
[120,1700,2601,440.59976931949251]
[120,1800,{"$f":"B9*1.53","v":2754},416.12200435729847]
[120,1900,2907,394.22084623323013]
["Power (kW)","Engine HS","Power take-off (rpm)","(Nm)"]
[120,1000,{"$f":"B12*1.91","v":1910},{"$f":"A12*9550/C12","v":600}]
[120,{"$f":"B12+100","v":1100},{"$f":"B13*1.91","v":2101},545.4545454545455]
[120,1200,2292,500]
[120,1300,2483,461.53846153846155]
[120,1400,2674,428.57142857142856]
[120,1500,2865,400]
[120,1600,3056,375]
[120,1700,3247,352.94117647058823]
[120,1800,3438,333.33333333333331]
[120,1900,3629,315.78947368421052]

{"sheet":"EG650P","index":35,"n_rows":53,"n_cols":4,"rows_kept":53,"cut":false,"hidden":false,"merged":[[0,0,0,3]]}
["EG650P"]
["Power (kW)","Engine LS","Power take-off (rpm)","(Nm)"]
[80,800,{"$f":"B3*1","v":800},{"$f":"A3*9550/C3","v":955}]
[80,900,900,848.88888888888891]
[80,{"$f":"B4+100","v":1000},1000,764]
[80,1100,1100,694.5454545454545]
[80,1200,1200,636.66666666666663]
[80,1300,1300,587.69230769230774]
[80,1400,1400,545.71428571428567]
[80,1500,1500,509.33333333333331]
[80,1600,1600,477.5]
[80,1700,1700,449.41176470588238]
[80,1800,1800,424.44444444444446]
[80,1900,1900,402.10526315789474]
["Power (kW)","Engine HS","Power take-off (rpm)","(Nm)"]
[80,800,{"$f":"B16*1.24","v":992},{"$f":"A16*9550/C16","v":770.16129032258061}]
[80,{"$f":"B16+100","v":900},1116,684.58781362007164]
[80,1000,1240,616.12903225806451]
[80,1100,1364,560.11730205278593]
[80,1200,1488,513.44086021505382]
[80,1300,1612,473.9454094292804]
[80,1400,{"$f":"B22*1.24","v":1736},440.09216589861751]
[80,1500,1860,410.75268817204301]
[80,1600,{"$f":"B24*1.24","v":1984},385.08064516129031]
[80,1700,2108,362.42884250474384]
[80,1800,2232,342.29390681003582]
[80,1900,2356,324.27843803056027]
["Power (kW)","Engine LS","Power take-off (rpm)","(Nm)"]
[120,800,{"$f":"B29*1","v":800},{"$f":"A29*9550/C29","v":1432.5}]
[120,900,900,1273.3333333333333]
[120,1000,1000,1146]
[120,1100,1100,1041.8181818181818]
[120,1200,1200,955]
[120,1300,{"$f":"B34*1","v":1300},881.53846153846155]
[120,{"$f":"B34+100","v":1400},{"$f":"B35*1","v":1400},818.57142857142856]
[120,1500,1500,764]
[120,1600,1600,716.25]
[120,1700,1700,674.11764705882354]
[120,1800,1800,636.66666666666663]
[120,1900,1900,603.15789473684208]
["Power (kW)","Engine HS","Power take-off (rpm)","(Nm)"]
[120,800,{"$f":"B42*1.24","v":992},{"$f":"A42*9550/C42","v":1155.241935483871}]
[120,900,{"$f":"B43*1.24","v":1116},1026.8817204301076]
[120,1000,1240,924.19354838709683]
[120,1100,{"$f":"B45*1.24","v":1364},840.17595307917884]
[120,{"$f":"B45+100","v":1200},{"$f":"B46*1.24","v":1488},770.16129032258061]
[120,1300,1612,710.91811414392055]
[120,1400,1736,660.13824884792632]
[120,1500,1860,616.12903225806451]
[120,1600,1984,577.62096774193549]
[120,1700,2108,543.64326375711573]
[120,1800,2232,513.44086021505382]
[120,1900,2356,486.41765704584043]

{"sheet":"EG660F","index":36,"n_rows":53,"n_cols":4,"rows_kept":53,"cut":false,"hidden":false,"merged":[[0,0,0,3]]}
["EG660F"]
["Power (kW)","Engine LS","Power take-off (rpm)","(Nm)"]
[80,800,{"$f":"B3*1","v":800},{"$f":"A3*9550/C3","v":955}]
[80,900,900,848.88888888888891]
[80,{"$f":"B4+100","v":1000},1000,764]
[80,1100,1100,694.5454545454545]
[80,1200,1200,636.66666666666663]
[80,1300,1300,587.69230769230774]
[80,1400,1400,545.71428571428567]
[80,1500,1500,509.33333333333331]
[80,1600,1600,477.5]
[80,1700,1700,449.41176470588238]
[80,1800,1800,424.44444444444446]
[80,1900,1900,402.10526315789474]
["Power (kW)","Engine HS","Power take-off (rpm)","(Nm)"]
[80,800,{"$f":"B16*1.24","v":992},{"$f":"A16*9550/C16","v":770.16129032258061}]
[80,{"$f":"B16+100","v":900},1116,684.58781362007164]
[80,1000,1240,616.12903225806451]
[80,1100,1364,560.11730205278593]
[80,1200,1488,513.44086021505382]
[80,1300,1612,473.9454094292804]
[80,1400,{"$f":"B22*1.24","v":1736},440.09216589861751]
[80,1500,1860,410.75268817204301]
[80,1600,{"$f":"B24*1.24","v":1984},385.08064516129031]
[80,1700,2108,362.42884250474384]
[80,1800,2232,342.29390681003582]
[80,1900,2356,324.27843803056027]
["Power (kW)","Engine LS","Power take-off (rpm)","(Nm)"]
[120,800,{"$f":"B29*1","v":800},{"$f":"A29*9550/C29","v":1432.5}]
[120,900,900,1273.3333333333333]
[120,1000,1000,1146]
[120,1100,1100,1041.8181818181818]
[120,1200,1200,955]
[120,1300,{"$f":"B34*1","v":1300},881.53846153846155]
[120,{"$f":"B34+100","v":1400},{"$f":"B35*1","v":1400},818.57142857142856]
[120,1500,1500,764]
[120,1600,1600,716.25]
[120,1700,1700,674.11764705882354]
[120,1800,1800,636.66666666666663]
[120,1900,1900,603.15789473684208]
["Power (kW)","Engine HS","Power take-off (rpm)","(Nm)"]
[120,800,{"$f":"B42*1.24","v":992},{"$f":"A42*9550/C42","v":1155.241935483871}]
[120,900,{"$f":"B43*1.24","v":1116},1026.8817204301076]
[120,1000,1240,924.19354838709683]
[120,1100,{"$f":"B45*1.24","v":1364},840.17595307917884]
[120,{"$f":"B45+100","v":1200},{"$f":"B46*1.24","v":1488},770.16129032258061]
[120,1300,1612,710.91811414392055]
[120,1400,1736,660.13824884792632]
[120,1500,1860,616.12903225806451]
[120,1600,1984,577.62096774193549]
[120,1700,2108,543.64326375711573]
[120,1800,2232,513.44086021505382]
[120,1900,2356,486.41765704584043]

{"sheet":"EG651P","index":37,"n_rows":49,"n_cols":4,"rows_kept":49,"cut":false,"hidden":false,"merged":[[0,0,0,3]]}
["EG651P"]
["Power (kW)","Engine LS","Power take-off (rpm)","(Nm)"]
[80,800,{"$f":"B3*1.28","v":1024},{"$f":"A3*9550/C3","v":746.09375}]
[80,900,1152,663.19444444444446]
[80,{"$f":"B4+100","v":1000},1280,596.875]
[80,1100,1408,542.61363636363637]
[80,1200,1536,497.39583333333331]
[80,1300,1664,459.13461538461536]
[80,1400,1792,426.33928571428572]
[80,1500,1920,397.91666666666669]
[80,1600,2048,373.046875]
[80,1700,2176,351.10294117647061]
[80,1800,2304,331.59722222222223]
[80,1900,{"$f":"B14*1.28","v":2432},314.14473684210526]
["Power (kW)","Engine HS","Power take-off (rpm)","(Nm)"]
[80,800,{"$f":"B16*1.58","v":1264},{"$f":"A16*9550/C16","v":604.43037974683546}]
[80,{"$f":"B16+100","v":900},1422,537.27144866385368]
[80,1000,1580,483.54430379746833]
[80,1100,1738,439.58573072497126]
[80,1200,1896,402.95358649789029]
[80,1300,2054,371.95715676728332]
[80,1400,2212,345.38878842676309]
[80,1500,2370,322.36286919831224]
[80,1600,2528,302.21518987341773]
[80,1700,2686,284.43782576321667]
[80,1800,2844,268.63572433192684]
[80,1900,3002,254.49700199866754]
["Power (kW)","Engine LS","Power take-off (rpm)","(Nm)"]
[120,1100,{"$f":"B29*1.28","v":1408},{"$f":"A29*9550/C29","v":813.9204545454545}]
[120,1200,1536,746.09375]
[120,1300,1664,688.70192307692309]
[120,{"$f":"B31+100","v":1400},1792,639.50892857142856]
[120,1500,1920,596.875]
[120,1600,2048,559.5703125]
[120,1700,2176,526.65441176470586]
[120,1800,2304,497.39583333333331]
[120,1900,2432,471.21710526315792]
["Power (kW)","Engine HS","Power take-off (rpm)","(Nm)"]
[120,900,{"$f":"B39*1.58","v":1422},{"$f":"A39*9550/C39","v":805.90717299578057}]
[120,1000,1580,725.31645569620252]
[120,1100,1738,659.3785960874568]
[120,{"$f":"B41+100","v":1200},1896,604.43037974683546]
[120,1300,2054,557.93573515092498]
[120,1400,2212,518.08318264014463]
[120,1500,2370,483.54430379746833]
[120,1600,2528,453.32278481012656]
[120,1700,2686,426.656738644825]
[120,1800,2844,402.95358649789029]
[120,1900,{"$f":"B49*1.58","v":3002},381.74550299800131]

{"sheet":"EG661F","index":38,"n_rows":49,"n_cols":4,"rows_kept":49,"cut":false,"hidden":false,"merged":[[0,0,0,3]]}
["EG661F"]
["Power (kW)","Engine LS","Power take-off (rpm)","(Nm)"]
[80,800,{"$f":"B3*1.28","v":1024},{"$f":"A3*9550/C3","v":746.09375}]
[80,{"$f":"B3+100","v":900},1152,663.19444444444446]
[80,1000,1280,596.875]
[80,1100,1408,542.61363636363637]
[80,1200,1536,497.39583333333331]
[80,1300,1664,459.13461538461536]
[80,1400,1792,426.33928571428572]
[80,1500,1920,397.91666666666669]
[80,1600,2048,373.046875]
[80,1700,2176,351.10294117647061]
[80,1800,2304,331.59722222222223]
[80,1900,2432,314.14473684210526]
["Power (kW)","Engine HS","Power take-off (rpm)","(Nm)"]
[80,800,{"$f":"B16*1.58","v":1264},{"$f":"A16*9550/C16","v":604.43037974683546}]
[80,{"$f":"B16+100","v":900},1422,537.27144866385368]
[80,1000,1580,483.54430379746833]
[80,1100,1738,439.58573072497126]
[80,1200,1896,402.95358649789029]
[80,1300,2054,371.95715676728332]
[80,1400,2212,345.38878842676309]
[80,1500,2370,322.36286919831224]
[80,1600,2528,302.21518987341773]
[80,1700,2686,284.43782576321667]
[80,1800,2844,268.63572433192684]
[80,1900,3002,254.49700199866754]
["Power (kW)","Engine LS","Power take-off (rpm)","(Nm)"]
[120,1100,{"$f":"B29*1.28","v":1408},{"$f":"A29*9550/C29","v":813.9204545454545}]
[120,{"$f":"B29+100","v":1200},1536,746.09375]
[120,1300,1664,688.70192307692309]
[120,1400,1792,639.50892857142856]
[120,1500,1920,596.875]
[120,1600,2048,559.5703125]
[120,1700,2176,526.65441176470586]
[120,1800,2304,497.39583333333331]
[120,1900,2432,471.21710526315792]
["Power (kW)","Engine HS","Power take-off (rpm)","(Nm)"]
[120,900,{"$f":"B39*1.58","v":1422},{"$f":"A39*9550/C39","v":805.90717299578057}]
[120,{"$f":"B39+100","v":1000},1580,725.31645569620252]
[120,1100,1738,659.3785960874568]
[120,1200,1896,{"$f":"A42*9550/C42","v":604.43037974683546}]
[120,1300,2054,557.93573515092498]
[120,1400,2212,518.08318264014463]
[120,1500,2370,483.54430379746833]
[120,1600,2528,453.32278481012656]
[120,1700,2686,426.656738644825]
[120,1800,2844,402.95358649789029]
[120,1900,3002,381.74550299800131]

{"sheet":"EG652P","index":39,"n_rows":51,"n_cols":4,"rows_kept":51,"cut":false,"hidden":false,"merged":[[0,0,0,3]]}
["EG652P"]
["Power (kW)","Engine LS","Power take-off (rpm)","(Nm)"]
[80,800,{"$f":"B3*0.82","v":656},{"$f":"A3*9550/C3","v":1164.6341463414635}]
[80,900,738,1035.230352303523]
[80,{"$f":"B4+100","v":1000},820,931.70731707317077]
[80,1100,902,847.00665188470066]
[80,1200,983.99999999999989,776.42276422764235]
[80,1300,1066,716.69793621013139]
[80,1400,1148,665.5052264808362]
[80,1500,1230,621.13821138211381]
[80,1600,1312,582.31707317073176]
[80,1700,1394,548.06312769010049]
[80,1800,1476,517.61517615176149]
[80,1900,1558,490.37227214377407]
["Power (kW)","Engine HS","Power take-off (rpm)","(Nm)"]
[80,800,{"$f":"B16*1.03","v":824},{"$f":"A16*9550/C16","v":927.18446601941753}]
[80,{"$f":"B16+100","v":900},927,824.1639697950377]
[80,1000,1030,741.747572815534]
[80,1100,1133,674.31597528684904]
[80,1200,1236,618.12297734627828]
[80,1300,1339,570.57505601194919]
[80,1400,1442,529.81969486823857]
[80,1500,1545,494.49838187702267]
[80,1600,1648,463.59223300970876]
[80,1700,1751,436.32210165619648]
[80,1800,1854,412.08198489751885]
[80,1900,1957,390.39345937659681]
["Power (kW)","Engine LS","Power take-off (rpm)","(Nm)"]
[120,1000,{"$f":"B29*0.82","v":820},{"$f":"A29*9550/C29","v":1397.560975609756}]
[120,1100,{"$f":"B30*0.82","v":902},1270.509977827051]
[120,1200,{"$f":"B31*0.82","v":983.99999999999989},1164.6341463414635]
[120,1300,{"$f":"B32*0.82","v":1066},1075.046904315197]
[120,{"$f":"B32+100","v":1400},1148,998.2578397212543]
[120,1500,1230,931.70731707317077]
[120,1600,1312,873.47560975609758]
[120,1700,1394,822.09469153515067]
[120,1800,1476,776.42276422764223]
[120,1900,1558,735.55840821566107]
["Power (kW)","Engine HS","Power take-off (rpm)","(Nm)"]
[120,800,{"$f":"B40*1.03","v":824},{"$f":"A40*9550/C40","v":1390.7766990291261}]
[120,900,{"$f":"B41*1.03","v":927},{"$f":"A41*9550/C41","v":1236.2459546925566}]
[120,1000,{"$f":"B42*1.03","v":1030},{"$f":"A42*9550/C42","v":1112.6213592233009}]
[120,1100,1133,1011.4739629302736]
[120,{"$f":"B43+100","v":1200},1236,927.18446601941753]
[120,1300,1339,855.86258401792384]
[120,1400,1442,794.7295423023578]
[120,1500,1545,741.747572815534]
[120,1600,1648,695.38834951456306]
[120,1700,1751,654.48315248429469]
[120,1800,1854,618.12297734627828]
[120,1900,1957,585.5901890648953]

{"sheet":"EG662F","index":40,"n_rows":51,"n_cols":4,"rows_kept":51,"cut":false,"hidden":false,"merged":[[0,0,0,3]]}
["EG662F"]
["Power (kW)","Engine LS","Power take-off (rpm)","(Nm)"]
[80,800,{"$f":"B3*0.82","v":656},{"$f":"A3*9550/C3","v":1164.6341463414635}]
[80,900,738,1035.230352303523]
[80,{"$f":"B4+100","v":1000},820,931.70731707317077]
[80,1100,902,847.00665188470066]
[80,1200,983.99999999999989,776.42276422764235]
[80,1300,1066,716.69793621013139]
[80,1400,1148,665.5052264808362]
[80,1500,1230,621.13821138211381]
[80,1600,1312,582.31707317073176]
[80,1700,1394,548.06312769010049]
[80,1800,1476,517.61517615176149]
[80,1900,1558,490.37227214377407]
["Power (kW)","Engine HS","Power take-off (rpm)","(Nm)"]
[80,800,{"$f":"B16*1.03","v":824},{"$f":"A16*9550/C16","v":927.18446601941753}]
[80,{"$f":"B16+100","v":900},927,824.1639697950377]
[80,1000,1030,741.747572815534]
[80,1100,1133,674.31597528684904]
[80,1200,1236,618.12297734627828]
[80,1300,1339,570.57505601194919]
[80,1400,1442,529.81969486823857]
[80,1500,1545,494.49838187702267]
[80,1600,1648,463.59223300970876]
[80,1700,1751,436.32210165619648]
[80,1800,1854,412.08198489751885]
[80,1900,1957,390.39345937659681]
["Power (kW)","Engine LS","Power take-off (rpm)","(Nm)"]
[120,1000,{"$f":"B29*0.82","v":820},{"$f":"A29*9550/C29","v":1397.560975609756}]
[120,1100,{"$f":"B30*0.82","v":902},1270.509977827051]
[120,1200,{"$f":"B31*0.82","v":983.99999999999989},1164.6341463414635]
[120,1300,{"$f":"B32*0.82","v":1066},1075.046904315197]
[120,{"$f":"B32+100","v":1400},1148,998.2578397212543]
[120,1500,1230,931.70731707317077]
[120,1600,1312,873.47560975609758]
[120,1700,1394,822.09469153515067]
[120,1800,1476,776.42276422764223]
[120,1900,1558,735.55840821566107]
["Power (kW)","Engine HS","Power take-off (rpm)","(Nm)"]
[120,800,{"$f":"B40*1.03","v":824},{"$f":"A40*9550/C40","v":1390.7766990291261}]
[120,900,{"$f":"B41*1.03","v":927},{"$f":"A41*9550/C41","v":1236.2459546925566}]
[120,1000,{"$f":"B42*1.03","v":1030},{"$f":"A42*9550/C42","v":1112.6213592233009}]
[120,1100,1133,1011.4739629302736]
[120,{"$f":"B43+100","v":1200},1236,927.18446601941753]
[120,1300,1339,855.86258401792384]
[120,1400,1442,794.7295423023578]
[120,1500,1545,741.747572815534]
[120,1600,1648,695.38834951456306]
[120,1700,1751,654.48315248429469]
[120,1800,1854,618.12297734627828]
[120,1900,1957,585.5901890648953]

{"sheet":"EG653P","index":41,"n_rows":44,"n_cols":4,"rows_kept":44,"cut":false,"hidden":false,"merged":[[0,0,0,3]]}
["EG653P"]
["Power (kW)","Engine LS","Power take-off (rpm)","(Nm)"]
[80,900,{"$f":"B3*1.03","v":927},{"$f":"A3*9550/C3","v":824.1639697950377}]
[80,{"$f":"B3+100","v":1000},1030,741.747572815534]
[80,1100,1133,674.31597528684904]
[80,1200,1236,618.12297734627828]
[80,1300,1339,570.57505601194919]
[80,1400,1442,529.81969486823857]
[80,1500,1545,494.49838187702267]
[80,1600,1648,463.59223300970876]
[80,1700,1751,436.32210165619648]
[80,1800,1854,412.08198489751885]
[80,1900,{"$f":"B13*1.03","v":1957},390.39345937659681]
["Power (kW)","Engine HS","Power take-off (rpm)","(Nm)"]
[80,800,{"$f":"B15*1.29","v":1032},{"$f":"A15*9550/C15","v":740.31007751937989}]
[80,{"$f":"B15+100","v":900},1161,658.0534022394487]
[80,1000,1290,592.24806201550382]
[80,1100,1419,538.40732910500356]
[80,1200,1548,493.54005167958655]
[80,1300,1677,455.57543231961836]
[80,1400,1806,423.03433001107419]
[80,1500,1935,394.83204134366923]
[80,1600,2064,370.15503875968994]
[80,1700,2193,348.3812129502964]
[80,1800,2322,329.02670111972435]
[80,1900,{"$f":"B26*1.29","v":2451},311.70950632394943]
["Power (kW)","Engine LS","Power take-off (rpm)","(Nm)"]
[120,1300,{"$f":"B28*1.03","v":1339},{"$f":"A28*9550/C28","v":855.86258401792384}]
[120,{"$f":"B28+100","v":1400},1442,794.7295423023578]
[120,1500,1545,741.747572815534]
[120,1600,1648,695.38834951456306]
[120,1700,1751,654.48315248429469]
[120,1800,{"$f":"B33*1.03","v":1854},618.12297734627828]
[120,1900,1957,585.5901890648953]
["Power (kW)","Engine HS","Power take-off (rpm)","(Nm)"]
[120,1100,{"$f":"B36*1.29","v":1419},{"$f":"A36*9550/C36","v":807.61099365750533}]
[120,{"$f":"B36+100","v":1200},1548,740.31007751937989]
[120,1300,1677,683.36314847942754]
[120,1400,1806,634.55149501661128]
[120,1500,1935,592.24806201550382]
[120,1600,2064,555.23255813953483]
[120,1700,2193,522.57181942544457]
[120,1800,2322,493.54005167958655]
[120,1900,2451,467.56425948592414]

{"sheet":"EG663F","index":42,"n_rows":44,"n_cols":4,"rows_kept":44,"cut":false,"hidden":false,"merged":[[0,0,0,3]]}
["EG663F"]
["Power (kW)","Engine LS","Power take-off (rpm)","(Nm)"]
[80,900,{"$f":"B3*1.03","v":927},{"$f":"A3*9550/C3","v":824.1639697950377}]
[80,{"$f":"B3+100","v":1000},1030,741.747572815534]
[80,1100,1133,674.31597528684904]
[80,1200,1236,618.12297734627828]
[80,1300,1339,570.57505601194919]
[80,1400,1442,529.81969486823857]
[80,1500,1545,494.49838187702267]
[80,1600,1648,463.59223300970876]
[80,1700,1751,436.32210165619648]
[80,1800,1854,412.08198489751885]
[80,1900,1957,390.39345937659681]
["Power (kW)","Engine HS","Power take-off (rpm)","(Nm)"]
[80,800,{"$f":"B15*1.29","v":1032},{"$f":"A15*9550/C15","v":740.31007751937989}]
[80,{"$f":"B15+100","v":900},1161,658.0534022394487]
[80,1000,1290,592.24806201550382]
[80,1100,1419,538.40732910500356]
[80,1200,1548,493.54005167958655]
[80,1300,1677,455.57543231961836]
[80,1400,1806,423.03433001107419]
[80,1500,1935,394.83204134366923]
[80,1600,2064,370.15503875968994]
[80,1700,2193,348.3812129502964]
[80,1800,2322,329.02670111972435]
[80,1900,2451,311.70950632394943]
["Power (kW)","Engine LS","Power take-off (rpm)","(Nm)"]
[120,1300,{"$f":"B28*1.03","v":1339},{"$f":"A28*9550/C28","v":855.86258401792384}]
[120,{"$f":"B28+100","v":1400},1442,794.7295423023578]
[120,1500,1545,741.747572815534]
[120,1600,1648,695.38834951456306]
[120,1700,1751,654.48315248429469]
[120,1800,1854,618.12297734627828]
[120,1900,1957,585.5901890648953]
["Power (kW)","Engine HS","Power take-off (rpm)","(Nm)"]
[120,1100,{"$f":"B36*1.29","v":1419},{"$f":"A36*9550/C36","v":807.61099365750533}]
[120,{"$f":"B36+100","v":1200},1548,740.31007751937989]
[120,1300,1677,683.36314847942754]
[120,1400,1806,634.55149501661128]
[120,1500,1935,592.24806201550382]
[120,1600,2064,555.23255813953483]
[120,1700,2193,522.57181942544457]
[120,1800,2322,493.54005167958655]
[120,1900,2451,467.56425948592414]

{"sheet":"EG670F","index":43,"n_rows":20,"n_cols":4,"rows_kept":20,"cut":false,"hidden":false,"merged":[[0,0,0,3]]}
["EG670F"]
["Power (kW)","Engine LS","Power take-off (rpm)","(Nm)"]
[110,1300,{"$f":"B3*1.61","v":2093},{"$f":"A3*9550/C3","v":501.91113234591495}]
[110,{"$f":"B3+100","v":1400},2254,466.06033717834958]
[110,1500,2415,434.98964803312629]
[110,1600,2576,407.80279503105589]
[110,1700,2737,383.81439532334673]
[110,1800,2898,362.49137336093855]
[110,1900,3059,343.41288002615232]
["Power (kW)","Engine HS","Power take-off (rpm)","(Nm)"]
[110,1000,{"$f":"B11*1.99","v":1990},{"$f":"A11*9550/C11","v":527.8894472361809}]
[110,{"$f":"B11+100","v":1100},2189,479.8994974874372]
[110,1200,2388,439.90787269681744]
[110,1300,2587,406.06880556629301]
[110,1400,2786,377.06389088298636]
[110,1500,2985,351.92629815745391]
[110,1600,3184,329.93090452261305]
[110,1700,3383,310.523204256577]
[110,1800,3582,293.27191513121159]
[110,1900,3781,277.83655117693729]

{"sheet":"EG671F","index":44,"n_rows":25,"n_cols":4,"rows_kept":25,"cut":false,"hidden":false,"merged":[[0,0,0,3]]}
["EG671F"]
["Power (kW)","Engine LS","Power take-off (rpm)","(Nm)"]
[110,1000,{"$f":"B3*2.06","v":2060},{"$f":"A3*9550/C3","v":509.95145631067959}]
[110,1100,{"$f":"B4*2.06","v":2266},463.59223300970876]
[110,1200,2472,424.95954692556631]
[110,1300,{"$f":"B6*2.06","v":2678},392.27035100821507]
[110,{"$f":"B6+100","v":1400},{"$f":"B7*2.06","v":2884},364.25104022191402]
[110,1500,3090,339.9676375404531]
[110,1600,3296,318.71966019417476]
[110,1700,3502,299.97144488863506]
[110,1800,{"$f":"B11*2.06","v":3708},283.30636461704421]
[110,1900,3914,268.39550332141033]
["Power (kW)","Engine HS","Power take-off (rpm)","(Nm)"]
[110,800,{"$f":"B14*2.55","v":2039.9999999999998},{"$f":"A14*9550/C14","v":514.95098039215691}]
[110,900,2295,457.73420479302831]
[110,1000,{"$f":"B16*2.55","v":2550},411.96078431372547]
[110,{"$f":"B16+100","v":1100},{"$f":"B17*2.55","v":2805},374.50980392156862]
[110,1200,3060,343.30065359477123]
[110,1300,3314.9999999999995,316.89291101055812]
[110,1400,3569.9999999999995,294.25770308123253]
[110,1500,3824.9999999999995,274.640522875817]
[110,1600,4079.9999999999995,257.47549019607845]
[110,1700,4335,242.32987312572087]
[110,1800,4590,228.86710239651416]
[110,1900,4845,216.82146542827658]

{"sheet":"EG672F","index":45,"n_rows":21,"n_cols":4,"rows_kept":21,"cut":false,"hidden":false,"merged":[[0,0,0,3]]}
["EG672F"]
["Power (kW)","Engine LS","Power take-off (rpm)","(Nm)"]
[110,1200,{"$f":"B3*1.66","v":1992},{"$f":"A3*9550/C3","v":527.35943775100407}]
[110,1300,2158,486.79332715477295]
[110,{"$f":"B4+100","v":1400},2324,452.02237521514633]
[110,1500,2490,421.88755020080322]
[110,1600,2656,395.51957831325302]
[110,1700,2822,372.25372076541458]
[110,1800,2988,351.57295850066936]
[110,1900,3154,333.06911857958147]
["Power (kW)","Engine HS","Power take-off (rpm)","(Nm)"]
[110,1000,{"$f":"B12*2.08","v":2080},{"$f":"A12*9550/C12","v":505.04807692307691}]
[110,{"$f":"B12+100","v":1100},2288,459.13461538461536]
[110,1200,2496,420.87339743589746]
[110,1300,2704,388.49852071005915]
[110,1400,2912,360.74862637362639]
[110,1500,3120,336.69871794871796]
[110,1600,3328,315.65504807692309]
[110,1700,3536,297.08710407239818]
[110,1800,3744,280.58226495726495]
[110,1900,3952,265.81477732793525]

{"sheet":"EG670PF U","index":46,"n_rows":25,"n_cols":4,"rows_kept":25,"cut":false,"hidden":false,"merged":[[0,0,0,3]]}
["EG670PF U"]
["Power (kW)","Engine LS","Power take-off (rpm)","(Nm)"]
[110,1000,{"$f":"B3*1.21","v":1210},{"$f":"A3*9550/C3","v":868.18181818181813}]
[110,1100,1331,789.25619834710744]
[110,1200,{"$f":"B5*1.21","v":1452},723.4848484848485]
[110,1300,{"$f":"B6*1.21","v":1573},667.83216783216778]
[110,{"$f":"B6+100","v":1400},{"$f":"B7*1.21","v":1694},620.12987012987014]
[110,1500,1815,578.78787878787875]
[110,1600,1936,542.61363636363637]
[110,1700,2057,510.69518716577539]
[110,1800,{"$f":"B11*1.21","v":2178},482.32323232323233]
[110,1900,2299,456.93779904306223]
["Power (kW)","Engine HS","Power take-off (rpm)","(Nm)"]
[110,800,{"$f":"B14*1.49","v":1192},{"$f":"A14*9550/C14","v":881.29194630872485}]
[110,900,{"$f":"B15*1.49","v":1341},783.37061894108876]
[110,1000,{"$f":"B16*1.49","v":1490},705.03355704697992]
[110,{"$f":"B16+100","v":1100},{"$f":"B17*1.49","v":1639},640.93959731543623]
[110,1200,1788,587.5279642058166]
[110,1300,1937,542.3335054207538]
[110,1400,2086,503.59539789069993]
[110,1500,2235,470.02237136465322]
[110,1600,2384,440.64597315436242]
[110,1700,2533,414.72562179234109]
[110,1800,2682,391.68530947054438]
[110,1900,{"$f":"B25*1.49","v":2831},371.07029318262096]

{"sheet":"EG670PF L","index":47,"n_rows":20,"n_cols":4,"rows_kept":20,"cut":false,"hidden":false,"merged":[[0,0,0,3]]}
["EG670PF L"]
["Power (kW)","Engine LS","Power take-off (rpm)","(Nm)"]
[110,1300,{"$f":"B3*1.61","v":2093},{"$f":"A3*9550/C3","v":501.91113234591495}]
[110,{"$f":"B3+100","v":1400},2254,466.06033717834958]
[110,1500,2415,434.98964803312629]
[110,1600,2576,407.80279503105589]
[110,1700,2737,383.81439532334673]
[110,1800,2898,362.49137336093855]
[110,1900,3059,343.41288002615232]
["Power (kW)","Engine HS","Power take-off (rpm)","(Nm)"]
[110,1000,{"$f":"B11*1.99","v":1990},{"$f":"A11*9550/C11","v":527.8894472361809}]
[110,{"$f":"B11+100","v":1100},2189,479.8994974874372]
[110,1200,2388,439.90787269681744]
[110,1300,2587,406.06880556629301]
[110,1400,2786,377.06389088298636]
[110,1500,2985,351.92629815745391]
[110,1600,3184,329.93090452261305]
[110,1700,3383,310.523204256577]
[110,1800,3582,293.27191513121159]
[110,1900,{"$f":"B20*1.99","v":3781},277.83655117693729]

{"sheet":"EG671PF U","index":48,"n_rows":23,"n_cols":4,"rows_kept":23,"cut":false,"hidden":false,"merged":[[0,0,0,3]]}
["EG671PF U"]
["Power (kW)","Engine LS","Power take-off (rpm)","(Nm)"]
[110,1100,{"$f":"B3*1.55","v":1705},{"$f":"A3*9550/C3","v":616.12903225806451}]
[110,1200,{"$f":"B4*1.55","v":1860},564.78494623655911]
[110,1300,{"$f":"B5*1.55","v":2015},521.33995037220848]
[110,{"$f":"B5+100","v":1400},{"$f":"B6*1.55","v":2170},484.10138248847926]
[110,1500,2325,451.8279569892473]
[110,1600,{"$f":"B8*1.55","v":2480},423.58870967741933]
[110,1700,{"$f":"B9*1.55","v":2635},398.67172675521823]
[110,1800,{"$f":"B10*1.55","v":2790},376.52329749103944]
[110,1900,2945,356.70628183361629]
["Power (kW)","Engine HS","Power take-off (rpm)","(Nm)"]
[110,900,{"$f":"B13*1.91","v":1719},{"$f":"A13*9550/C13","v":611.11111111111109}]
[110,1000,{"$f":"B14*1.91","v":1910},550]
[110,{"$f":"B14+100","v":1100},{"$f":"B15*1.91","v":2101},500]
[110,1200,2292,458.33333333333331]
[110,1300,2483,423.07692307692309]
[110,1400,2674,392.85714285714283]
[110,1500,2865,366.66666666666669]
[110,1600,3056,343.75]
[110,1700,3247,323.52941176470586]
[110,1800,{"$f":"B22*1.91","v":3438},305.55555555555554]
[110,1900,3629,289.4736842105263]

{"sheet":"EG671PF L","index":49,"n_rows":25,"n_cols":4,"rows_kept":25,"cut":false,"hidden":false,"merged":[[0,0,0,3]]}
["EG671PF L"]
["Power (kW)","Engine LS","Power take-off (rpm)","(Nm)"]
[110,1000,{"$f":"B3*2.06","v":2060},{"$f":"A3*9550/C3","v":509.95145631067959}]
[110,1100,{"$f":"B4*2.06","v":2266},463.59223300970876]
[110,1200,{"$f":"B5*2.06","v":2472},424.95954692556631]
[110,1300,2678,392.27035100821507]
[110,{"$f":"B6+100","v":1400},2884,364.25104022191402]
[110,1500,3090,339.9676375404531]
[110,1600,3296,318.71966019417476]
[110,1700,3502,299.97144488863506]
[110,1800,{"$f":"B11*2.06","v":3708},283.30636461704421]
[110,1900,3914,268.39550332141033]
["Power (kW)","Engine HS","Power take-off (rpm)","(Nm)"]
[110,800,{"$f":"B14*2.55","v":2039.9999999999998},{"$f":"A14*9550/C14","v":514.95098039215691}]
[110,900,{"$f":"B15*2.55","v":2295},457.73420479302831]
[110,1000,{"$f":"B16*2.55","v":2550},411.96078431372547]
[110,{"$f":"B16+100","v":1100},2805,374.50980392156862]
[110,1200,{"$f":"B18*2.55","v":3060},343.30065359477123]
[110,1300,3314.9999999999995,316.89291101055812]
[110,1400,3569.9999999999995,294.25770308123253]
[110,1500,3824.9999999999995,274.640522875817]
[110,1600,4079.9999999999995,257.47549019607845]
[110,1700,4335,242.32987312572087]
[110,1800,4590,228.86710239651416]
[110,1900,{"$f":"B25*2.55","v":4845},216.82146542827658]

{"sheet":"EG672PF U","index":50,"n_rows":18,"n_cols":4,"rows_kept":18,"cut":false,"hidden":false,"merged":[[0,0,0,3]]}
["EG672PF U"]
["Power (kW)","Engine LS","Power take-off (rpm)","(Nm)"]
[110,1400,{"$f":"B3*1.25","v":1750},{"$f":"A3*9550/C3","v":600.28571428571433}]
[110,{"$f":"B3+100","v":1500},{"$f":"B4*1.25","v":1875},560.26666666666665]
[110,1600,{"$f":"B5*1.25","v":2000},525.25]
[110,1700,2125,494.35294117647061]
[110,1800,2250,466.88888888888891]
[110,1900,2375,442.31578947368422]
["Power (kW)","Engine HS","Power take-off (rpm)","(Nm)"]
[110,1100,{"$f":"B10*1.56","v":1716},{"$f":"A10*9550/C10","v":612.17948717948718}]
[110,{"$f":"B10+100","v":1200},1872,561.16452991452991]
[110,1300,2028,517.99802761341221]
[110,1400,2184,480.99816849816852]
[110,1500,2340,448.9316239316239]
[110,1600,2496,420.87339743589746]
[110,1700,2652,396.11613876319757]
[110,1800,2808,374.10968660968661]
[110,1900,2964,354.4197031039136]

{"sheet":"EG672PF L","index":51,"n_rows":21,"n_cols":4,"rows_kept":21,"cut":false,"hidden":false,"merged":[[0,0,0,3]]}
["EG672PF L"]
["Power (kW)","Engine LS","Power take-off (rpm)","(Nm)"]
[110,1200,{"$f":"B3*1.66","v":1992},{"$f":"A3*9550/C3","v":527.35943775100407}]
[110,1300,{"$f":"B4*1.66","v":2158},486.79332715477295]
[110,1400,{"$f":"B5*1.66","v":2324},452.02237521514633]
[110,{"$f":"B5+100","v":1500},{"$f":"B6*1.66","v":2490},421.88755020080322]
[110,1600,2656,395.51957831325302]
[110,1700,2822,372.25372076541458]
[110,1800,2988,351.57295850066936]
[110,1900,3154,333.06911857958147]
["Power (kW)","Engine HS","Power take-off (rpm)","(Nm)"]
[110,1000,{"$f":"B12*2.08","v":2080},{"$f":"A12*9550/C12","v":505.04807692307691}]
[110,1100,{"$f":"B13*2.08","v":2288},459.13461538461536]
[110,{"$f":"B13+100","v":1200},{"$f":"B14*2.08","v":2496},420.87339743589746]
[110,1300,2704,388.49852071005915]
[110,1400,2912,360.74862637362639]
[110,1500,3120,336.69871794871796]
[110,1600,3328,315.65504807692309]
[110,1700,{"$f":"B19*2.08","v":3536},297.08710407239818]
[110,1800,3744,280.58226495726495]
[110,1900,{"$f":"B21*2.08","v":3952},265.81477732793525]

{"sheet":"EG670PP U","index":52,"n_rows":23,"n_cols":4,"rows_kept":23,"cut":false,"hidden":false,"merged":[[0,0,0,3]]}
["EG670PP U"]
["Power (kW)","Engine LS","Power take-off (rpm)","(Nm)"]
[110,1100,{"$f":"B3*1.55","v":1705},{"$f":"A3*9550/C3","v":616.12903225806451}]
[110,1200,1860,564.78494623655911]
[110,1300,2015,521.33995037220848]
[110,{"$f":"B5+100","v":1400},2170,484.10138248847926]
[110,1500,2325,451.8279569892473]
[110,1600,2480,423.58870967741933]
[110,1700,{"$f":"B9*1.55","v":2635},398.67172675521823]
[110,1800,2790,376.52329749103944]
[110,1900,2945,356.70628183361629]
["Power (kW)","Engine HS","Power take-off (rpm)","(Nm)"]
[110,900,{"$f":"B13*1.91","v":1719},{"$f":"A13*9550/C13","v":611.11111111111109}]
[110,1000,{"$f":"B14*1.91","v":1910},550]
[110,{"$f":"B14+100","v":1100},2101,500]
[110,1200,2292,458.33333333333331]
[110,1300,2483,423.07692307692309]
[110,1400,2674,392.85714285714283]
[110,1500,2865,366.66666666666669]
[110,1600,3056,343.75]
[110,1700,3247,323.52941176470586]
[110,1800,{"$f":"B22*1.91","v":3438},305.55555555555554]
[110,1900,3629,289.4736842105263]

{"sheet":"EG671PP U","index":53,"n_rows":23,"n_cols":4,"rows_kept":23,"cut":false,"hidden":false,"merged":[[0,0,0,3]]}
["EG671PP U"]
["Power (kW)","Engine LS","Power take-off (rpm)","(Nm)"]
[110,1100,{"$f":"B3*1.55","v":1705},{"$f":"A3*9550/C3","v":616.12903225806451}]
[110,1200,{"$f":"B4*1.55","v":1860},564.78494623655911]
[110,1300,2015,521.33995037220848]
[110,{"$f":"B5+100","v":1400},2170,484.10138248847926]
[110,1500,2325,451.8279569892473]
[110,1600,2480,423.58870967741933]
[110,1700,{"$f":"B9*1.55","v":2635},398.67172675521823]
[110,1800,2790,376.52329749103944]
[110,1900,2945,356.70628183361629]
["Power (kW)","Engine HS","Power take-off (rpm)","(Nm)"]
[110,900,{"$f":"B13*1.91","v":1719},{"$f":"A13*9550/C13","v":611.11111111111109}]
[110,1000,{"$f":"B14*1.91","v":1910},550]
[110,{"$f":"B14+100","v":1100},2101,500]
[110,1200,2292,458.33333333333331]
[110,1300,2483,423.07692307692309]
[110,1400,2674,392.85714285714283]
[110,1500,2865,366.66666666666669]
[110,1600,3056,343.75]
[110,1700,3247,323.52941176470586]
[110,1800,{"$f":"B22*1.91","v":3438},305.55555555555554]
[110,1900,3629,289.4736842105263]

{"sheet":"EG670PP L","index":54,"n_rows":25,"n_cols":4,"rows_kept":25,"cut":false,"hidden":false,"merged":[[0,0,0,3]]}
["EG670PP L"]
["Power (kW)","Engine LS","Power take-off (rpm)","(Nm)"]
[110,1000,{"$f":"B3*1.24","v":1240},{"$f":"A3*9550/C3","v":847.17741935483866}]
[110,1100,{"$f":"B4*1.24","v":1364},770.16129032258061]
[110,1200,{"$f":"B5*1.24","v":1488},705.98118279569894]
[110,1300,1612,651.6749379652606]
[110,{"$f":"B6+100","v":1400},1736,605.12672811059906]
[110,1500,1860,564.78494623655911]
[110,1600,1984,529.48588709677415]
[110,1700,2108,498.33965844402275]
[110,1800,2232,470.65412186379928]
[110,1900,2356,445.88285229202035]
["Power (kW)","Engine HS","Power take-off (rpm)","(Nm)"]
[110,800,{"$f":"B14*1.53","v":1224},{"$f":"A14*9550/C14","v":858.25163398692814}]
[110,900,{"$f":"B15*1.53","v":1377},762.89034132171389]
[110,1000,{"$f":"B16*1.53","v":1530},686.60130718954247]
[110,{"$f":"B16+100","v":1100},{"$f":"B17*1.53","v":1683},624.1830065359477]
[110,1200,1836,572.16775599128539]
[110,1300,1989,528.15485168426346]
[110,1400,2142,490.4295051353875]
[110,1500,2295,457.73420479302831]
[110,1600,2448,429.12581699346407]
[110,1700,2601,403.88312187620147]
[110,1800,2754,381.44517066085695]
[110,1900,2907,361.36910904712761]

{"sheet":"EG671PP L","index":55,"n_rows":25,"n_cols":4,"rows_kept":25,"cut":false,"hidden":false,"merged":[[0,0,0,3]]}
["EG671PP L"]
["Power (kW)","Engine LS","Power take-off (rpm)","(Nm)"]
[110,1000,{"$f":"B3*1.24","v":1240},{"$f":"A3*9550/C3","v":847.17741935483866}]
[110,1100,{"$f":"B4*1.24","v":1364},770.16129032258061]
[110,1200,{"$f":"B5*1.24","v":1488},705.98118279569894]
[110,1300,1612,651.6749379652606]
[110,{"$f":"B6+100","v":1400},1736,605.12672811059906]
[110,1500,1860,564.78494623655911]
[110,1600,1984,529.48588709677415]
[110,1700,2108,498.33965844402275]
[110,1800,2232,470.65412186379928]
[110,1900,2356,445.88285229202035]
["Power (kW)","Engine HS","Power take-off (rpm)","(Nm)"]
[110,800,{"$f":"B14*1.53","v":1224},{"$f":"A14*9550/C14","v":858.25163398692814}]
[110,900,{"$f":"B15*1.53","v":1377},762.89034132171389]
[110,1000,{"$f":"B16*1.53","v":1530},686.60130718954247]
[110,{"$f":"B16+100","v":1100},{"$f":"B17*1.53","v":1683},624.1830065359477]
[110,1200,1836,572.16775599128539]
[110,1300,1989,528.15485168426346]
[110,1400,2142,490.4295051353875]
[110,1500,2295,457.73420479302831]
[110,1600,2448,429.12581699346407]
[110,1700,2601,403.88312187620147]
[110,1800,2754,381.44517066085695]
[110,1900,2907,361.36910904712761]

{"sheet":"EG672PP U","index":56,"n_rows":18,"n_cols":4,"rows_kept":18,"cut":false,"hidden":false,"merged":[[0,0,0,3]]}
["EG672PP U"]
["Power (kW)","Engine LS","Power take-off (rpm)","(Nm)"]
[110,1400,{"$f":"B3*1.25","v":1750},{"$f":"A3*9550/C3","v":600.28571428571433}]
[110,{"$f":"B3+100","v":1500},1875,560.26666666666665]
[110,1600,2000,525.25]
[110,1700,2125,494.35294117647061]
[110,1800,2250,466.88888888888891]
[110,1900,2375,442.31578947368422]
["Power (kW)","Engine HS","Power take-off (rpm)","(Nm)"]
[110,1100,{"$f":"B10*1.56","v":1716},{"$f":"A10*9550/C10","v":612.17948717948718}]
[110,{"$f":"B10+100","v":1200},1872,561.16452991452991]
[110,1300,2028,517.99802761341221]
[110,1400,2184,480.99816849816852]
[110,1500,2340,448.9316239316239]
[110,1600,{"$f":"B15*1.56","v":2496},420.87339743589746]
[110,1700,2652,396.11613876319757]
[110,1800,{"$f":"B17*1.56","v":2808},374.10968660968661]
[110,1900,2964,354.4197031039136]

{"sheet":"EG673PP U","index":57,"n_rows":18,"n_cols":4,"rows_kept":18,"cut":false,"hidden":false,"merged":[[0,0,0,3]]}
["EG673PP U"]
["Power (kW)","Engine LS","Power take-off (rpm)","(Nm)"]
[110,1400,{"$f":"B3*1.25","v":1750},{"$f":"A3*9550/C3","v":600.28571428571433}]
[110,{"$f":"B3+100","v":1500},{"$f":"B4*1.25","v":1875},560.26666666666665]
[110,1600,2000,525.25]
[110,1700,2125,494.35294117647061]
[110,1800,2250,466.88888888888891]
[110,1900,2375,442.31578947368422]
["Power (kW)","Engine HS","Power take-off (rpm)","(Nm)"]
[110,1100,{"$f":"B10*1.56","v":1716},{"$f":"A10*9550/C10","v":612.17948717948718}]
[110,{"$f":"B10+100","v":1200},{"$f":"B11*1.56","v":1872},561.16452991452991]
[110,1300,2028,517.99802761341221]
[110,1400,2184,480.99816849816852]
[110,1500,2340,448.9316239316239]
[110,1600,{"$f":"B15*1.56","v":2496},420.87339743589746]
[110,1700,2652,396.11613876319757]
[110,1800,{"$f":"B17*1.56","v":2808},374.10968660968661]
[110,1900,2964,354.4197031039136]

{"sheet":"EG672PP L","index":58,"n_rows":20,"n_cols":4,"rows_kept":20,"cut":false,"hidden":false,"merged":[[0,0,0,3]]}
["EG672PP L"]
["Power (kW)","Engine LS","Power take-off (rpm)","(Nm)"]
[110,1300,{"$f":"B3*1","v":1300},{"$f":"A3*9550/C3","v":808.07692307692309}]
[110,1400,{"$f":"B4*1","v":1400},750.35714285714289]
[110,{"$f":"B4+100","v":1500},{"$f":"B5*1","v":1500},700.33333333333337]
[110,1600,1600,656.5625]
[110,1700,1700,617.94117647058829]
[110,1800,1800,583.61111111111109]
[110,1900,1900,552.89473684210532]
["Power (kW)","Engine HS","Power take-off (rpm)","(Nm)"]
[110,1000,{"$f":"B11*1.25","v":1250},{"$f":"A11*9550/C11","v":840.4}]
[110,1100,{"$f":"B12*1.25","v":1375},764]
[110,{"$f":"B12+100","v":1200},{"$f":"B13*1.25","v":1500},700.33333333333337]
[110,1300,{"$f":"B14*1.25","v":1625},646.46153846153845]
[110,1400,{"$f":"B15*1.25","v":1750},600.28571428571433]
[110,1500,1875,560.26666666666665]
[110,1600,2000,525.25]
[110,1700,2125,494.35294117647061]
[110,1800,2250,466.88888888888891]
[110,1900,2375,442.31578947368422]

{"sheet":"EG673PP L","index":59,"n_rows":20,"n_cols":4,"rows_kept":20,"cut":false,"hidden":false,"merged":[[0,0,0,3]]}
["EG672PP L"]
["Power (kW)","Engine LS","Power take-off (rpm)","(Nm)"]
[110,1300,{"$f":"B3*1","v":1300},{"$f":"A3*9550/C3","v":808.07692307692309}]
[110,1400,{"$f":"B4*1","v":1400},750.35714285714289]
[110,{"$f":"B4+100","v":1500},{"$f":"B5*1","v":1500},700.33333333333337]
[110,1600,1600,656.5625]
[110,1700,1700,617.94117647058829]
[110,1800,1800,583.61111111111109]
[110,1900,1900,552.89473684210532]
["Power (kW)","Engine HS","Power take-off (rpm)","(Nm)"]
[110,1000,{"$f":"B11*1.25","v":1250},{"$f":"A11*9550/C11","v":840.4}]
[110,1100,{"$f":"B12*1.25","v":1375},764]
[110,{"$f":"B12+100","v":1200},{"$f":"B13*1.25","v":1500},700.33333333333337]
[110,1300,{"$f":"B14*1.25","v":1625},646.46153846153845]
[110,1400,{"$f":"B15*1.25","v":1750},600.28571428571433]
[110,1500,1875,560.26666666666665]
[110,1600,2000,525.25]
[110,1700,2125,494.35294117647061]
[110,1800,2250,466.88888888888891]
[110,1900,2375,442.31578947368422]

{"sheet":"EG6R DDxxB","index":60,"n_rows":41,"n_cols":4,"rows_kept":41,"cut":false,"hidden":false,"merged":[[0,0,0,3]]}
["EG6R DDxxB"]
["Power (kW)","Engine LS","Power take-off (rpm)","(Nm)"]
[100,900,{"$f":"B3*1.63","v":1467},{"$f":"A3*9550/C3","v":650.988411724608}]
[100,{"$f":"B3+100","v":1000},1630,{"$f":"A4*9550/C4","v":585.88957055214723}]
[100,1100,1792.9999999999998,532.62688232013397]
[100,1200,1955.9999999999998,488.24130879345608]
[100,1300,{"$f":"B7*1.63","v":2119},450.68428504011325]
[100,1400,2282,418.49255039439089]
[100,1500,2445,390.59304703476482]
[100,1600,2608,366.18098159509202]
[100,1700,2771,344.64092385420423]
[100,1800,2934,325.494205862304]
[100,1900,{"$f":"B13*1.63","v":3097},308.36293186955118]
["Power (kW)","Engine HS","Power take-off (rpm)","(Nm)"]
[100,800,{"$f":"B15*2.09","v":1672},{"$f":"A15*9550/C15","v":571.17224880382776}]
[100,{"$f":"B15+100","v":900},1880.9999999999998,507.70866560340249]
[100,1000,2090,456.93779904306223]
[100,1100,2299,415.39799913005652]
[100,1200,2508,380.78149920255186]
[100,1300,2717,351.49061464850939]
[100,1400,2926,326.38414217361588]
[100,1500,{"$f":"B22*2.09","v":3135},304.62519936204149]
[100,1600,3344,285.58612440191388]
[100,1700,3552.9999999999995,268.78694061356606]
[100,1800,3761.9999999999995,253.85433280170125]
[100,1900,3970.9999999999995,240.49357844371698]
["Power (kW)","Engine LS","Power take-off (rpm)","(Nm)"]
[160,1500,{"$f":"B28*1.63","v":2445},{"$f":"A28*9550/C28","v":624.94887525562376}]
[160,{"$f":"B28+100","v":1600},{"$f":"B29*1.63","v":2608},585.88957055214723]
[160,1700,2771,551.42547816672686]
[160,1800,{"$f":"B31*1.63","v":2934},520.79072937968647]
[160,1900,3097,493.38069099128188]
["Power (kW)","Engine HS","Power take-off (rpm)","(Nm)"]
[160,1200,{"$f":"B34*2.09","v":2508},{"$f":"A34*9550/C34","v":609.25039872408297}]
[160,{"$f":"B34+100","v":1300},2717,562.38498343761501]
[160,1400,2926,522.21462747778537]
[160,1500,3135,487.40031897926633]
[160,1600,{"$f":"B38*2.09","v":3344},456.93779904306223]
[160,1700,3552.9999999999995,430.05910498170567]
[160,1800,3761.9999999999995,406.16693248272202]
[160,1900,3970.9999999999995,384.78972550994717]

{"sheet":"EG8R DCxxB","index":61,"n_rows":48,"n_cols":4,"rows_kept":48,"cut":false,"hidden":false,"merged":[[0,0,0,3]]}
["EG8R DCxxB"]
["Power (kW)","Engine LS","Power take-off (rpm)","(Nm)"]
[100,800,{"$f":"B3*1.51","v":1208},{"$f":"A3*9550/C3","v":790.56291390728472}]
[100,{"$f":"B3+100","v":900},{"$f":"B4*1.51","v":1359},{"$f":"A4*9550/C4","v":702.72259013980863}]
[100,1000,1510,632.4503311258278]
[100,1100,1661,574.95484647802527]
[100,1200,1812,527.04194260485656]
[100,1300,1963,486.50025471217526]
[100,1400,2114,451.75023651844845]
[100,1500,2265,421.6335540838852]
[100,1600,2416,395.28145695364236]
[100,1700,2567,372.02960654460458]
[100,1800,{"$f":"B13*1.51","v":2718},351.36129506990432]
[100,1900,2869,332.86859532938308]
["Power (kW)","Engine HS","Power take-off (rpm)","(Nm)"]
[100,800,{"$f":"B16*1.95","v":1560},{"$f":"A16*9550/C16","v":612.17948717948718}]
[100,{"$f":"B16+100","v":900},1755,544.15954415954411]
[100,1000,1950,489.74358974358972]
[100,1100,2145,445.22144522144521]
[100,1200,2340,408.11965811965814]
[100,1300,2535,376.7258382642998]
[100,1400,2730,349.81684981684981]
[100,1500,2925,326.4957264957265]
[100,1600,3120,306.08974358974359]
[100,1700,3315,288.08446455505282]
[100,1800,{"$f":"B26*1.95","v":3510},272.07977207977206]
[100,1900,{"$f":"B27*1.95","v":3705},257.75978407557358]
["Power (kW)","Engine LS","Power take-off (rpm)","(Nm)"]
[160,1200,{"$f":"B29*1.51","v":1812},{"$f":"A29*9550/C29","v":843.2671081677704}]
[160,{"$f":"B29+100","v":1300},{"$f":"B30*1.51","v":1963},778.4004075394804]
[160,1400,2114,722.80037842951754]
[160,1500,2265,674.6136865342163]
[160,1600,2416,632.4503311258278]
[160,1700,2567,595.24737047136739]
[160,1800,2718,562.17807211184697]
[160,1900,2869,532.58975252701293]
["Power (kW)","Engine HS","Power take-off (rpm)","(Nm)"]
[160,900,{"$f":"B38*1.95","v":1755},{"$f":"A38*9550/C38","v":870.65527065527067}]
[160,{"$f":"B38+100","v":1000},{"$f":"B39*1.95","v":1950},783.58974358974353]
[160,1100,2145,712.35431235431236]
[160,1200,2340,652.991452991453]
[160,1300,2535,602.76134122287965]
[160,1400,2730,559.70695970695965]
[160,1500,2925,522.39316239316236]
[160,1600,{"$f":"B45*1.95","v":3120},489.74358974358972]
[160,1700,3315,460.93514328808448]
[160,1800,3510,435.32763532763533]
[160,1900,3705,412.41565452091766]

{"sheet":"EG9R DCxxB","index":62,"n_rows":48,"n_cols":4,"rows_kept":48,"cut":false,"hidden":false,"merged":[[0,0,0,3]]}
["EG9R DCxxB"]
["Power (kW)","Engine LS","Power take-off (rpm)","(Nm)"]
[100,800,{"$f":"B3*1.39","v":1112},{"$f":"A3*9550/C3","v":858.8129496402878}]
[100,{"$f":"B3+100","v":900},{"$f":"B4*1.39","v":1251},{"$f":"A4*9550/C4","v":763.3892885691447}]
[100,1000,1390,687.05035971223026]
[100,1100,{"$f":"B6*1.39","v":1529},624.59123610202744]
[100,1200,1667.9999999999998,572.54196642685861]
[100,1300,1806.9999999999998,528.50027670171562]
[100,1400,1945.9999999999998,490.75025693730737]
[100,1500,2085,458.03357314148678]
[100,1600,2224,429.4064748201439]
[100,1700,2363,404.14727041895895]
[100,1800,2502,381.69464428457235]
[100,1900,{"$f":"B14*1.39","v":2641},361.60545248012119]
["Power (kW)","Engine HS","Power take-off (rpm)","(Nm)"]
[100,800,{"$f":"B16*1.79","v":1432},{"$f":"A16*9550/C16","v":666.89944134078212}]
[100,{"$f":"B16+100","v":900},1611,592.79950341402855]
[100,1000,1790,533.51955307262574]
[100,1100,1969,485.01777552056882]
[100,1200,2148,444.59962756052141]
[100,1300,2327,410.39965620971208]
[100,1400,2506,381.08539505187548]
[100,1500,2685,355.67970204841714]
[100,1600,2864,333.44972067039106]
[100,1700,3043,313.83503121919159]
[100,1800,3222,296.39975170701427]
[100,1900,{"$f":"B27*1.79","v":3401},280.79976477506614]
["Power (kW)","Engine LS","Power take-off (rpm)","(Nm)"]
[160,1200,{"$f":"B29*1.39","v":1667.9999999999998},{"$f":"A29*9550/C29","v":916.06714628297379}]
[160,{"$f":"B29+100","v":1300},{"$f":"B30*1.39","v":1806.9999999999998},845.60044272274502]
[160,1400,1945.9999999999998,785.20041109969179]
[160,1500,2085,732.85371702637894]
[160,1600,{"$f":"B33*1.39","v":2224},687.05035971223026]
[160,1700,{"$f":"B34*1.39","v":2363},646.6356326703343]
[160,1800,2502,610.71143085531571]
[160,1900,2641,578.56872396819392]
["Power (kW)","Engine HS","Power take-off (rpm)","(Nm)"]
[160,900,{"$f":"B38*1.79","v":1611},{"$f":"A38*9550/C38","v":948.47920546244563}]
[160,{"$f":"B38+100","v":1000},{"$f":"B39*1.79","v":1790},853.63128491620114]
[160,1100,1969,776.02844083291006]
[160,1200,2148,711.35940409683428]
[160,1300,2327,656.63944993553935]
[160,1400,2506,609.73663208300081]
[160,1500,2685,569.08752327746743]
[160,1600,2864,533.51955307262574]
[160,1700,3043,502.13604995070654]
[160,1800,{"$f":"B47*1.79","v":3222},474.23960273122282]
[160,1900,3401,449.27962364010585]

{"sheet":"EG10R DCxxB","index":63,"n_rows":48,"n_cols":4,"rows_kept":48,"cut":false,"hidden":false,"merged":[[0,0,0,3]]}
["EG10R DCxxB"]
["Power (kW)","Engine LS","Power take-off (rpm)","(Nm)"]
[100,800,{"$f":"B3*1.19","v":952},{"$f":"A3*9550/C3","v":1003.1512605042017}]
[100,{"$f":"B3+100","v":900},1071,{"$f":"A4*9550/C4","v":891.6900093370682}]
[100,1000,1190,802.52100840336129]
[100,1100,1309,729.56455309396483]
[100,1200,1428,668.76750700280115]
[100,1300,1547,617.32385261797026]
[100,1400,1666,573.2292917166867]
[100,1500,1785,535.0140056022409]
[100,1600,1904,501.57563025210084]
[100,1700,2023,472.07118141374195]
[100,1800,2142,445.8450046685341]
[100,1900,{"$f":"B14*1.19","v":2261},422.3794781070323]
["Power (kW)","Engine HS","Power take-off (rpm)","(Nm)"]
[100,800,{"$f":"B16*1.53","v":1224},{"$f":"A16*9550/C16","v":780.22875816993462}]
[100,{"$f":"B16+100","v":900},1377,693.53667392883074]
[100,1000,1530,624.1830065359477]
[100,1100,1683,567.43909685086157]
[100,1200,1836,520.15250544662308]
[100,1300,1989,480.14077425842135]
[100,1400,2142,445.8450046685341]
[100,1500,2295,416.12200435729847]
[100,1600,2448,390.11437908496731]
[100,1700,2601,367.16647443291043]
[100,1800,2754,346.76833696441537]
[100,1900,2907,328.51737186102514]
["Power (kW)","Engine LS","Power take-off (rpm)","(Nm)"]
[160,1200,{"$f":"B29*1.19","v":1428},{"$f":"A29*9550/C29","v":1070.0280112044818}]
[160,{"$f":"B29+100","v":1300},1547,987.71816418875244]
[160,1400,1666,917.1668667466987]
[160,1500,1785,856.02240896358546]
[160,1600,1904,802.52100840336129]
[160,1700,2023,755.31389026198713]
[160,1800,2142,713.3520074696545]
[160,1900,2261,675.80716497125161]
["Power (kW)","Engine HS","Power take-off (rpm)","(Nm)"]
[160,900,{"$f":"B38*1.53","v":1377},{"$f":"A38*9550/C38","v":1109.6586782861293}]
[160,{"$f":"B38+100","v":1000},1530,998.69281045751632]
[160,1100,1683,907.90255496137854]
[160,1200,1836,832.24400871459693]
[160,1300,1989,768.22523881347411]
[160,1400,2142,713.3520074696545]
[160,1500,2295,665.79520697167754]
[160,1600,2448,624.1830065359477]
[160,1700,{"$f":"B46*1.53","v":2601},587.46635909265672]
[160,1800,2754,554.82933914306466]
[160,1900,2907,525.62779497764018]

{"sheet":"EG25R DAxx","index":64,"n_rows":20,"n_cols":4,"rows_kept":20,"cut":false,"hidden":false,"merged":[[0,0,0,3]]}
["EG25R Daxx"]
["Power (kW)","Engine LS","Power take-off (rpm)","(Nm)"]
[250,1300,{"$f":"B3*0.76","v":988},{"$f":"A3*9550/C3","v":2416.4979757085021}]
[250,{"$f":"B3+100","v":1400},1064,2243.8909774436092]
[250,1500,1140,2094.2982456140353]
[250,1600,1216,1963.4046052631579]
[250,1700,1292,1847.9102167182662]
[250,1800,1368,1745.2485380116959]
[250,1900,1444,1653.393351800554]
["Power (kW)","Engine HS","Power take-off (rpm)","(Nm)"]
[250,1000,{"$f":"B11*0.97","v":970},{"$f":"A11*9550/C11","v":2461.3402061855668}]
[250,{"$f":"B11+100","v":1100},1067,2237.5820056232428]
[250,1200,1164,2051.1168384879725]
[250,1300,1261,1893.3386201427438]
[250,1400,1358,1758.1001472754051]
[250,1500,1455,1640.8934707903779]
[250,1600,1552,1538.3376288659795]
[250,1700,1649,1447.8471801091571]
[250,1800,1746,1367.4112256586484]
[250,1900,1843,1295.4422137818774]

{"sheet":"EG11R DDxxyy U","index":65,"n_rows":19,"n_cols":4,"rows_kept":19,"cut":false,"hidden":false,"merged":[[0,0,0,3]]}
["EG11R DDxxyy U"]
["Power (kW)","Engine LS","Power take-off (rpm)","(Nm)"]
[100,1600,{"$f":"B3*1.63","v":2608},{"$f":"A3*9550/C3","v":366.18098159509202}]
[100,{"$f":"B3+100","v":1700},2771,344.64092385420423]
[100,1800,{"$f":"B5*1.63","v":2934},325.494205862304]
[100,1900,3097,308.36293186955118]
["Power (kW)","Engine HS","Power take-off (rpm)","(Nm)"]
[100,1200,{"$f":"B8*2.09","v":2508},{"$f":"A8*9550/C8","v":380.78149920255186}]
[100,{"$f":"B8+100","v":1300},2717,351.49061464850939]
[100,1400,2926,326.38414217361588]
[100,1500,{"$f":"B11*2.09","v":3135},304.62519936204149]
[100,1600,3344,285.58612440191388]
[100,1700,3552.9999999999995,268.78694061356606]
[100,1800,3761.9999999999995,253.85433280170125]
[100,1900,{"$f":"B15*2.09","v":3970.9999999999995},240.49357844371698]
["Power (kW)","Engine LS","Power take-off (rpm)","(Nm)"]
["Power (kW)","Engine HS","Power take-off (rpm)","(Nm)"]
[150,1800,{"$f":"B18*2.09","v":3761.9999999999995},{"$f":"A18*9550/C18","v":380.78149920255186}]
[150,1900,{"$f":"B19*2.09","v":3970.9999999999995},{"$f":"A19*9550/C19","v":360.74036766557549}]

{"sheet":"EG11R DDxxyy L","index":66,"n_rows":41,"n_cols":4,"rows_kept":41,"cut":false,"hidden":false,"merged":[[0,0,0,3]]}
["EG11R DDxxyy L"]
["Power (kW)","Engine LS","Power take-off (rpm)","(Nm)"]
[100,900,{"$f":"B3*1.63","v":1467},{"$f":"A3*9550/C3","v":650.988411724608}]
[100,1000,{"$f":"B4*1.63","v":1630},585.88957055214723]
[100,1100,1792.9999999999998,532.62688232013397]
[100,1200,{"$f":"B6*1.63","v":1955.9999999999998},488.24130879345608]
[100,1300,{"$f":"B7*1.63","v":2119},450.68428504011325]
[100,1400,2282,418.49255039439089]
[100,1500,2445,390.59304703476482]
[100,1600,{"$f":"B10*1.63","v":2608},366.18098159509202]
[100,{"$f":"B10+100","v":1700},{"$f":"B11*1.63","v":2771},344.64092385420423]
[100,1800,{"$f":"B12*1.63","v":2934},325.494205862304]
[100,1900,3097,308.36293186955118]
["Power (kW)","Engine HS","Power take-off (rpm)","(Nm)"]
[100,800,{"$f":"B15*2.09","v":1672},{"$f":"A15*9550/C15","v":571.17224880382776}]
[100,900,1880.9999999999998,507.70866560340249]
[100,1000,2090,456.93779904306223]
[100,1100,2299,415.39799913005652]
[100,1200,{"$f":"B19*2.09","v":2508},380.78149920255186]
[100,{"$f":"B19+100","v":1300},{"$f":"B20*2.09","v":2717},351.49061464850939]
[100,1400,2926,326.38414217361588]
[100,1500,{"$f":"B22*2.09","v":3135},304.62519936204149]
[100,1600,3344,285.58612440191388]
[100,1700,3552.9999999999995,268.78694061356606]
[100,1800,3761.9999999999995,253.85433280170125]
[100,1900,{"$f":"B26*2.09","v":3970.9999999999995},240.49357844371698]
["Power (kW)","Engine LS","Power take-off (rpm)","(Nm)"]
[160,1500,{"$f":"B28*1.63","v":2445},{"$f":"A28*9550/C28","v":624.94887525562376}]
[160,{"$f":"B28+100","v":1600},2608,585.88957055214723]
[160,1700,2771,551.42547816672686]
[160,1800,2934,520.79072937968647]
[160,1900,{"$f":"B32*1.63","v":3097},493.38069099128188]
["Power (kW)","Engine HS","Power take-off (rpm)","(Nm)"]
[160,1200,{"$f":"B34*2.09","v":2508},{"$f":"A34*9550/C34","v":609.25039872408297}]
[160,{"$f":"B34+100","v":1300},{"$f":"B35*2.09","v":2717},562.38498343761501]
[160,1400,2926,522.21462747778537]
[160,1500,{"$f":"B37*2.09","v":3135},487.40031897926633]
[160,1600,3344,456.93779904306223]
[160,1700,3552.9999999999995,430.05910498170567]
[160,1800,3761.9999999999995,406.16693248272202]
[160,1900,{"$f":"B41*2.09","v":3970.9999999999995},384.78972550994717]

{"sheet":"EG11R DDxxyy L&U","index":67,"n_rows":52,"n_cols":4,"rows_kept":52,"cut":false,"hidden":false,"merged":[[0,0,0,3]]}
["EG11R DDxxyy L&U"]
["Power (kW)","Engine LS","Power take-off (rpm)","(Nm)"]
[100,800,{"$f":"B3*1.63","v":1304},{"$f":"A3*9550/C3","v":732.36196319018404}]
[100,900,{"$f":"B4*1.63","v":1467},650.988411724608]
[100,1000,{"$f":"B5*1.63","v":1630},585.88957055214723]
[100,1100,1792.9999999999998,532.62688232013397]
[100,1200,{"$f":"B7*1.63","v":1955.9999999999998},488.24130879345608]
[100,1300,{"$f":"B8*1.63","v":2119},450.68428504011325]
[100,1400,2282,418.49255039439089]
[100,1500,2445,390.59304703476482]
[100,1600,{"$f":"B11*1.63","v":2608},366.18098159509202]
[100,{"$f":"B11+100","v":1700},{"$f":"B12*1.63","v":2771},344.64092385420423]
[100,1800,{"$f":"B13*1.63","v":2934},325.494205862304]
[100,1900,3097,308.36293186955118]
["Power (kW)","Engine HS","Power take-off (rpm)","(Nm)"]
[100,800,{"$f":"B16*2.09","v":1672},{"$f":"A16*9550/C16","v":571.17224880382776}]
[100,900,1880.9999999999998,507.70866560340249]
[100,1000,2090,456.93779904306223]
[100,1100,2299,415.39799913005652]
[100,1200,2508,380.78149920255186]
[100,{"$f":"B20+100","v":1300},2717,351.49061464850939]
[100,1400,2926,326.38414217361588]
[100,1500,3135,304.62519936204149]
[100,1600,3344,285.58612440191388]
[100,1700,3552.9999999999995,268.78694061356606]
[100,1800,3761.9999999999995,253.85433280170125]
[100,1900,3970.9999999999995,240.49357844371698]
["Power (kW)","Engine LS","Power take-off (rpm)","(Nm)"]
[160,900,{"$f":"B29*1.63","v":1467},{"$f":"A29*9550/C29","v":1041.5814587593729}]
[160,1000,1630,937.42331288343553]
[160,1100,1792.9999999999998,852.20301171221422]
[160,1200,1955.9999999999998,781.18609406952976]
[160,1300,2119,721.09485606418127]
[160,1400,2282,669.58808063102538]
[160,1500,2445,624.94887525562376]
[160,{"$f":"B35+100","v":1600},2608,585.88957055214723]
[160,1700,2771,551.42547816672686]
[160,1800,2934,520.79072937968647]
[160,1900,{"$f":"B39*1.63","v":3097},493.38069099128188]
["Power (kW)","Engine HS","Power take-off (rpm)","(Nm)"]
[160,800,{"$f":"B41*2.09","v":1672},{"$f":"A41*9550/C41","v":913.87559808612446}]
[160,900,{"$f":"B42*2.09","v":1880.9999999999998},{"$f":"A42*9550/C42","v":812.33386496544404}]
[160,1000,{"$f":"B43*2.09","v":2090},731.1004784688995]
[160,1100,2299,664.63679860809043]
[160,1200,{"$f":"B45*2.09","v":2508},609.25039872408297]
[160,{"$f":"B45+100","v":1300},{"$f":"B46*2.09","v":2717},562.38498343761501]
[160,1400,2926,522.21462747778537]
[160,1500,{"$f":"B48*2.09","v":3135},487.40031897926633]
[160,1600,3344,456.93779904306223]
[160,1700,3552.9999999999995,430.05910498170567]
[160,1800,3761.9999999999995,406.16693248272202]
[160,1900,{"$f":"B52*2.09","v":3970.9999999999995},384.78972550994717]

{"sheet":"EG12R DCxxyy U","index":68,"n_rows":26,"n_cols":4,"rows_kept":26,"cut":false,"hidden":false,"merged":[[0,0,0,3]]}
["EG12R DCxxyy U"]
["Power (kW)","Engine LS","Power take-off (rpm)","(Nm)"]
[100,1300,{"$f":"B3*1.51","v":1963},{"$f":"A3*9550/C3","v":486.50025471217526}]
[100,1400,2114,451.75023651844845]
[100,1500,2265,421.6335540838852]
[100,1600,2416,395.28145695364236]
[100,{"$f":"B6+100","v":1700},2567,372.02960654460458]
[100,1800,2718,351.36129506990432]
[100,1900,{"$f":"B9*1.51","v":2869},332.86859532938308]
["Power (kW)","Engine HS","Power take-off (rpm)","(Nm)"]
[100,1000,{"$f":"B11*1.95","v":1950},{"$f":"A11*9550/C11","v":489.74358974358972}]
[100,1100,2145,445.22144522144521]
[100,1200,2340,408.11965811965814]
[100,{"$f":"B13+100","v":1300},2535,376.7258382642998]
[100,1400,2730,349.81684981684981]
[100,1500,2925,326.4957264957265]
[100,1600,3120,306.08974358974359]
[100,1700,3315,288.08446455505282]
[100,1800,3510,272.07977207977206]
[100,1900,3705,257.75978407557358]
["Power (kW)","Engine LS","Power take-off (rpm)","(Nm)"]
["Power (kW)","Engine HS","Power take-off (rpm)","(Nm)"]
[160,1600,{"$f":"B23*1.95","v":3120},{"$f":"A23*9550/C23","v":489.74358974358972}]
[160,{"$f":"B23+100","v":1700},3315,460.93514328808448]
[160,1800,3510,435.32763532763533]
[160,1900,3705,412.41565452091766]

{"sheet":"EG12R DCxxyy L","index":69,"n_rows":48,"n_cols":4,"rows_kept":48,"cut":false,"hidden":false,"merged":[[0,0,0,3]]}
["EG12R DCxxyy L"]
["Power (kW)","Engine LS","Power take-off (rpm)","(Nm)"]
[100,800,{"$f":"B3*1.51","v":1208},{"$f":"A3*9550/C3","v":790.56291390728472}]
[100,900,1359,702.72259013980863]
[100,1000,1510,632.4503311258278]
[100,1100,1661,574.95484647802527]
[100,1200,1812,527.04194260485656]
[100,1300,1963,486.50025471217526]
[100,1400,2114,451.75023651844845]
[100,1500,2265,421.6335540838852]
[100,1600,2416,395.28145695364236]
[100,{"$f":"B11+100","v":1700},2567,372.02960654460458]
[100,1800,2718,351.36129506990432]
[100,1900,{"$f":"B14*1.51","v":2869},332.86859532938308]
["Power (kW)","Engine HS","Power take-off (rpm)","(Nm)"]
[100,800,{"$f":"B16*1.95","v":1560},{"$f":"A16*9550/C16","v":612.17948717948718}]
[100,900,1755,544.15954415954411]
[100,1000,1950,489.74358974358972]
[100,1100,2145,445.22144522144521]
[100,1200,2340,408.11965811965814]
[100,{"$f":"B20+100","v":1300},2535,376.7258382642998]
[100,1400,2730,349.81684981684981]
[100,1500,2925,326.4957264957265]
[100,1600,3120,306.08974358974359]
[100,1700,3315,288.08446455505282]
[100,1800,3510,272.07977207977206]
[100,1900,3705,257.75978407557358]
["Power (kW)","Engine LS","Power take-off (rpm)","(Nm)"]
[160,1200,{"$f":"B29*1.51","v":1812},{"$f":"A29*9550/C29","v":843.2671081677704}]
[160,{"$f":"B29+100","v":1300},1963,778.4004075394804]
[160,1400,2114,722.80037842951754]
[160,1500,2265,674.6136865342163]
[160,1600,2416,632.4503311258278]
[160,1700,{"$f":"B34*1.51","v":2567},595.24737047136739]
[160,1800,{"$f":"B35*1.51","v":2718},562.17807211184697]
[160,1900,{"$f":"B36*1.51","v":2869},532.58975252701293]
["Power (kW)","Engine HS","Power take-off (rpm)","(Nm)"]
[160,900,{"$f":"B38*1.95","v":1755},{"$f":"A38*9550/C38","v":870.65527065527067}]
[160,1000,1950,783.58974358974353]
[160,1100,2145,712.35431235431236]
[160,1200,{"$f":"B41*1.95","v":2340},{"$f":"A41*9550/C41","v":652.991452991453}]
[160,1300,{"$f":"B42*1.95","v":2535},{"$f":"A42*9550/C42","v":602.76134122287965}]
[160,1400,2730,559.70695970695965]
[160,1500,2925,522.39316239316236]
[160,1600,{"$f":"B45*1.95","v":3120},489.74358974358972]
[160,{"$f":"B45+100","v":1700},{"$f":"B46*1.95","v":3315},460.93514328808448]
[160,1800,3510,435.32763532763533]
[160,1900,3705,412.41565452091766]

{"sheet":"EG12R DCxxyy L&U","index":70,"n_rows":53,"n_cols":4,"rows_kept":53,"cut":false,"hidden":false,"merged":[[0,0,0,3]]}
["EG12R DCxxyy L&U"]
["Power (kW)","Engine LS","Power take-off (rpm)","(Nm)"]
[100,800,{"$f":"B3*1.51","v":1208},{"$f":"A3*9550/C3","v":790.56291390728472}]
[100,900,1359,702.72259013980863]
[100,1000,1510,632.4503311258278]
[100,1100,1661,574.95484647802527]
[100,1200,1812,527.04194260485656]
[100,1300,1963,486.50025471217526]
[100,1400,2114,451.75023651844845]
[100,1500,2265,421.6335540838852]
[100,1600,2416,395.28145695364236]
[100,{"$f":"B11+100","v":1700},2567,372.02960654460458]
[100,1800,{"$f":"B13*1.51","v":2718},351.36129506990432]
[100,1900,2869,332.86859532938308]
["Power (kW)","Engine HS","Power take-off (rpm)","(Nm)"]
[100,800,{"$f":"B16*1.95","v":1560},{"$f":"A16*9550/C16","v":612.17948717948718}]
[100,900,1755,544.15954415954411]
[100,1000,1950,489.74358974358972]
[100,1100,2145,445.22144522144521]
[100,1200,2340,408.11965811965814]
[100,{"$f":"B20+100","v":1300},2535,376.7258382642998]
[100,1400,{"$f":"B22*1.95","v":2730},349.81684981684981]
[100,1500,2925,326.4957264957265]
[100,1600,3120,306.08974358974359]
[100,1700,3315,288.08446455505282]
[100,1800,3510,272.07977207977206]
[100,1900,{"$f":"B27*1.95","v":3705},257.75978407557358]
["Power (kW)","Engine LS","Power take-off (rpm)","(Nm)"]
[160,800,{"$f":"B29*1.51","v":1208},{"$f":"A29*9550/C29","v":1264.9006622516556}]
[160,900,{"$f":"B30*1.51","v":1359},1124.3561442236939]
[160,1000,{"$f":"B31*1.51","v":1510},1011.9205298013245]
[160,1100,{"$f":"B32*1.51","v":1661},919.92775436484044]
[160,1200,{"$f":"B33*1.51","v":1812},843.2671081677704]
[160,1300,1963,778.4004075394804]
[160,1400,2114,722.80037842951754]
[160,1500,2265,674.6136865342163]
[160,{"$f":"B36+100","v":1600},2416,632.4503311258278]
[160,1700,2567,595.24737047136739]
[160,1800,2718,562.17807211184697]
[160,1900,{"$f":"B40*1.51","v":2869},532.58975252701293]
["Power (kW)","Engine HS","Power take-off (rpm)","(Nm)"]
[160,800,{"$f":"B42*1.95","v":1560},{"$f":"A42*9550/C42","v":979.48717948717945}]
[160,900,1755,{"$f":"A43*9550/C43","v":870.65527065527067}]
[160,1000,1950,783.58974358974353]
[160,1100,2145,712.35431235431236]
[160,1200,2340,652.991452991453]
[160,{"$f":"B46+100","v":1300},2535,602.76134122287965]
[160,1400,{"$f":"B48*1.95","v":2730},559.70695970695965]
[160,1500,2925,522.39316239316236]
[160,1600,{"$f":"B50*1.95","v":3120},489.74358974358972]
[160,1700,3315,460.93514328808448]
[160,1800,3510,435.32763532763533]
[160,1900,3705,412.41565452091766]

{"sheet":"EG13R DCxxyy U","index":71,"n_rows":26,"n_cols":4,"rows_kept":26,"cut":false,"hidden":false,"merged":[[0,0,0,3]]}
["EG13R DCxxyy U"]
["Power (kW)","Engine LS","Power take-off (rpm)","(Nm)"]
[100,1300,{"$f":"B3*1.39","v":1806.9999999999998},{"$f":"A3*9550/C3","v":528.50027670171562}]
[100,1400,{"$f":"B4*1.39","v":1945.9999999999998},490.75025693730737]
[100,1500,2085,458.03357314148678]
[100,1600,2224,429.4064748201439]
[100,{"$f":"B6+100","v":1700},2363,404.14727041895895]
[100,1800,{"$f":"B8*1.39","v":2502},381.69464428457235]
[100,1900,2641,361.60545248012119]
["Power (kW)","Engine HS","Power take-off (rpm)","(Nm)"]
[100,1000,{"$f":"B11*1.79","v":1790},{"$f":"A11*9550/C11","v":533.51955307262574}]
[100,1100,1969,485.01777552056882]
[100,1200,2148,444.59962756052141]
[100,{"$f":"B13+100","v":1300},2327,410.39965620971208]
[100,1400,2506,381.08539505187548]
[100,1500,2685,355.67970204841714]
[100,1600,2864,333.44972067039106]
[100,1700,3043,313.83503121919159]
[100,1800,3222,296.39975170701427]
[100,1900,{"$f":"B20*1.79","v":3401},280.79976477506614]
["Power (kW)","Engine LS","Power take-off (rpm)","(Nm)"]
["Power (kW)","Engine HS","Power take-off (rpm)","(Nm)"]
[160,1600,{"$f":"B23*1.79","v":2864},{"$f":"A23*9550/C23","v":533.51955307262574}]
[160,{"$f":"B23+100","v":1700},3043,502.13604995070654]
[160,1800,3222,474.23960273122282]
[160,1900,{"$f":"B26*1.79","v":3401},449.27962364010585]

{"sheet":"EG13R DCxxyy L","index":72,"n_rows":48,"n_cols":4,"rows_kept":48,"cut":false,"hidden":false,"merged":[[0,0,0,3]]}
["EG13R DCxxyy L"]
["Power (kW)","Engine LS","Power take-off (rpm)","(Nm)"]
[100,800,{"$f":"B3*1.39","v":1112},{"$f":"A3*9550/C3","v":858.8129496402878}]
[100,900,1251,763.3892885691447]
[100,1000,1390,687.05035971223026]
[100,1100,1529,624.59123610202744]
[100,1200,1667.9999999999998,572.54196642685861]
[100,1300,1806.9999999999998,528.50027670171562]
[100,1400,1945.9999999999998,490.75025693730737]
[100,1500,2085,458.03357314148678]
[100,1600,2224,429.4064748201439]
[100,{"$f":"B11+100","v":1700},2363,404.14727041895895]
[100,1800,2502,381.69464428457235]
[100,1900,2641,361.60545248012119]
["Power (kW)","Engine HS","Power take-off (rpm)","(Nm)"]
[100,800,{"$f":"B16*1.79","v":1432},{"$f":"A16*9550/C16","v":666.89944134078212}]
[100,900,1611,592.79950341402855]
[100,1000,1790,533.51955307262574]
[100,1100,1969,485.01777552056882]
[100,1200,2148,444.59962756052141]
[100,{"$f":"B20+100","v":1300},2327,410.39965620971208]
[100,1400,2506,381.08539505187548]
[100,1500,2685,355.67970204841714]
[100,1600,2864,333.44972067039106]
[100,1700,3043,313.83503121919159]
[100,1800,3222,296.39975170701427]
[100,1900,{"$f":"B27*1.79","v":3401},280.79976477506614]
["Power (kW)","Engine LS","Power take-off (rpm)","(Nm)"]
[160,1200,{"$f":"B29*1.39","v":1667.9999999999998},{"$f":"A29*9550/C29","v":916.06714628297379}]
[160,{"$f":"B29+100","v":1300},{"$f":"B30*1.39","v":1806.9999999999998},845.60044272274502]
[160,1400,1945.9999999999998,785.20041109969179]
[160,1500,2085,732.85371702637894]
[160,1600,2224,687.05035971223026]
[160,1700,2363,646.6356326703343]
[160,1800,2502,610.71143085531571]
[160,1900,{"$f":"B36*1.39","v":2641},578.56872396819392]
["Power (kW)","Engine HS","Power take-off (rpm)","(Nm)"]
[160,900,{"$f":"B38*1.79","v":1611},{"$f":"A38*9550/C38","v":948.47920546244563}]
[160,1000,{"$f":"B39*1.79","v":1790},853.63128491620114]
[160,1100,1969,776.02844083291006]
[160,1200,2148,{"$f":"A41*9550/C41","v":711.35940409683428}]
[160,1300,2327,{"$f":"A42*9550/C42","v":656.63944993553935}]
[160,1400,2506,609.73663208300081]
[160,1500,2685,569.08752327746743]
[160,1600,2864,533.51955307262574]
[160,{"$f":"B45+100","v":1700},3043,502.13604995070654]
[160,1800,3222,474.23960273122282]
[160,1900,{"$f":"B48*1.79","v":3401},449.27962364010585]

{"sheet":"EG13R DCxxyy U&L","index":73,"n_rows":53,"n_cols":4,"rows_kept":53,"cut":false,"hidden":false,"merged":[[0,0,0,3]]}
["EG13R DCxxyy U&L"]
["Power (kW)","Engine LS","Power take-off (rpm)","(Nm)"]
[100,800,{"$f":"B3*1.39","v":1112},{"$f":"A3*9550/C3","v":858.8129496402878}]
[100,900,1251,763.3892885691447]
[100,1000,1390,687.05035971223026]
[100,1100,1529,624.59123610202744]
[100,1200,1667.9999999999998,572.54196642685861]
[100,1300,1806.9999999999998,528.50027670171562]
[100,1400,1945.9999999999998,490.75025693730737]
[100,1500,2085,458.03357314148678]
[100,1600,2224,429.4064748201439]
[100,{"$f":"B11+100","v":1700},2363,404.14727041895895]
[100,1800,2502,381.69464428457235]
[100,1900,2641,361.60545248012119]
["Power (kW)","Engine HS","Power take-off (rpm)","(Nm)"]
[100,800,{"$f":"B16*1.79","v":1432},{"$f":"A16*9550/C16","v":666.89944134078212}]
[100,900,1611,592.79950341402855]
[100,1000,1790,533.51955307262574]
[100,1100,1969,485.01777552056882]
[100,1200,2148,444.59962756052141]
[100,{"$f":"B20+100","v":1300},2327,410.39965620971208]
[100,1400,2506,381.08539505187548]
[100,1500,2685,355.67970204841714]
[100,1600,2864,333.44972067039106]
[100,1700,3043,313.83503121919159]
[100,1800,3222,296.39975170701427]
[100,1900,{"$f":"B27*1.79","v":3401},280.79976477506614]
["Power (kW)","Engine LS","Power take-off (rpm)","(Nm)"]
[160,800,{"$f":"B29*1.39","v":1112},{"$f":"A29*9550/C29","v":1374.1007194244605}]
[160,900,1251,1221.4228617106314]
[160,1000,1390,1099.2805755395684]
[160,1100,1529,999.34597776324392]
[160,1200,{"$f":"B33*1.39","v":1667.9999999999998},916.06714628297379]
[160,{"$f":"B33+100","v":1300},{"$f":"B34*1.39","v":1806.9999999999998},845.60044272274502]
[160,1400,1945.9999999999998,785.20041109969179]
[160,1500,2085,732.85371702637894]
[160,1600,2224,687.05035971223026]
[160,1700,2363,646.6356326703343]
[160,1800,2502,610.71143085531571]
[160,1900,{"$f":"B40*1.39","v":2641},578.56872396819392]
["Power (kW)","Engine HS","Power take-off (rpm)","(Nm)"]
[160,800,{"$f":"B42*1.79","v":1432},{"$f":"A42*9550/C42","v":1067.0391061452515}]
[160,900,{"$f":"B43*1.79","v":1611},948.47920546244563]
[160,1000,{"$f":"B44*1.79","v":1790},853.63128491620114]
[160,1100,1969,776.02844083291006]
[160,1200,2148,{"$f":"A46*9550/C46","v":711.35940409683428}]
[160,1300,2327,{"$f":"A47*9550/C47","v":656.63944993553935}]
[160,1400,2506,609.73663208300081]
[160,1500,2685,569.08752327746743]
[160,1600,2864,533.51955307262574]
[160,{"$f":"B50+100","v":1700},3043,502.13604995070654]
[160,1800,3222,474.23960273122282]
[160,1900,{"$f":"B53*1.79","v":3401},449.27962364010585]

{"sheet":"EG16R DCxxyy U","index":74,"n_rows":26,"n_cols":4,"rows_kept":26,"cut":false,"hidden":false,"merged":[[0,0,0,3]]}
["EG16R DCxxyy U"]
["Power (kW)","Engine LS","Power take-off (rpm)","(Nm)"]
[100,1300,{"$f":"B3*1.19","v":1547},{"$f":"A3*9550/C3","v":617.32385261797026}]
[100,1400,1666,573.2292917166867]
[100,1500,1785,535.0140056022409]
[100,1600,1904,501.57563025210084]
[100,{"$f":"B6+100","v":1700},{"$f":"B7*1.19","v":2023},472.07118141374195]
[100,1800,2142,445.8450046685341]
[100,1900,2261,422.3794781070323]
["Power (kW)","Engine HS","Power take-off (rpm)","(Nm)"]
[100,1000,{"$f":"B11*1.53","v":1530},{"$f":"A11*9550/C11","v":624.1830065359477}]
[100,1100,{"$f":"B12*1.53","v":1683},567.43909685086157]
[100,1200,{"$f":"B13*1.53","v":1836},520.15250544662308]
[100,{"$f":"B13+100","v":1300},1989,480.14077425842135]
[100,1400,{"$f":"B15*1.53","v":2142},445.8450046685341]
[100,1500,2295,416.12200435729847]
[100,1600,2448,390.11437908496731]
[100,1700,2601,367.16647443291043]
[100,1800,{"$f":"B19*1.53","v":2754},346.76833696441537]
[100,1900,{"$f":"B20*1.53","v":2907},328.51737186102514]
["Power (kW)","Engine LS","Power take-off (rpm)","(Nm)"]
["Power (kW)","Engine HS","Power take-off (rpm)","(Nm)"]
[160,1600,{"$f":"B23*1.53","v":2448},{"$f":"A23*9550/C23","v":624.1830065359477}]
[160,{"$f":"B23+100","v":1700},{"$f":"B24*1.53","v":2601},587.46635909265672]
[160,1800,{"$f":"B25*1.53","v":2754},554.82933914306466]
[160,1900,{"$f":"B26*1.53","v":2907},525.62779497764018]

{"sheet":"EG16R DCxxyy L","index":75,"n_rows":48,"n_cols":4,"rows_kept":48,"cut":false,"hidden":false,"merged":[[0,0,0,3]]}
["EG16R DCxxyy L"]
["Power (kW)","Engine LS","Power take-off (rpm)","(Nm)"]
[100,800,{"$f":"B3*1.19","v":952},{"$f":"A3*9550/C3","v":1003.1512605042017}]
[100,900,1071,891.6900093370682]
[100,1000,1190,802.52100840336129]
[100,1100,1309,729.56455309396483]
[100,1200,1428,668.76750700280115]
[100,1300,1547,617.32385261797026]
[100,1400,1666,573.2292917166867]
[100,1500,1785,535.0140056022409]
[100,1600,1904,501.57563025210084]
[100,{"$f":"B11+100","v":1700},2023,472.07118141374195]
[100,1800,2142,445.8450046685341]
[100,1900,{"$f":"B14*1.19","v":2261},422.3794781070323]
["Power (kW)","Engine HS","Power take-off (rpm)","(Nm)"]
[100,800,{"$f":"B16*1.53","v":1224},{"$f":"A16*9550/C16","v":780.22875816993462}]
[100,900,{"$f":"B17*1.53","v":1377},693.53667392883074]
[100,1000,1530,624.1830065359477]
[100,1100,1683,567.43909685086157]
[100,1200,1836,520.15250544662308]
[100,{"$f":"B20+100","v":1300},1989,480.14077425842135]
[100,1400,2142,445.8450046685341]
[100,1500,2295,416.12200435729847]
[100,1600,{"$f":"B24*1.53","v":2448},390.11437908496731]
[100,1700,2601,367.16647443291043]
[100,1800,2754,346.76833696441537]
[100,1900,{"$f":"B27*1.53","v":2907},328.51737186102514]
["Power (kW)","Engine LS","Power take-off (rpm)","(Nm)"]
[160,1200,{"$f":"B29*1.19","v":1428},{"$f":"A29*9550/C29","v":1070.0280112044818}]
[160,{"$f":"B29+100","v":1300},{"$f":"B30*1.19","v":1547},987.71816418875244]
[160,1400,1666,917.1668667466987]
[160,1500,1785,856.02240896358546]
[160,1600,1904,802.52100840336129]
[160,1700,2023,755.31389026198713]
[160,1800,2142,713.3520074696545]
[160,1900,{"$f":"B36*1.19","v":2261},675.80716497125161]
["Power (kW)","Engine HS","Power take-off (rpm)","(Nm)"]
[160,900,{"$f":"B38*1.53","v":1377},{"$f":"A38*9550/C38","v":1109.6586782861293}]
[160,1000,{"$f":"B39*1.53","v":1530},998.69281045751632]
[160,1100,{"$f":"B40*1.53","v":1683},907.90255496137854]
[160,1200,1836,{"$f":"A41*9550/C41","v":832.24400871459693}]
[160,1300,1989,{"$f":"A42*9550/C42","v":768.22523881347411}]
[160,1400,2142,713.3520074696545]
[160,1500,2295,665.79520697167754]
[160,1600,2448,624.1830065359477]
[160,{"$f":"B45+100","v":1700},2601,587.46635909265672]
[160,1800,{"$f":"B47*1.53","v":2754},554.82933914306466]
[160,1900,2907,525.62779497764018]

{"sheet":"EG16R DCxxyy U&L","index":76,"n_rows":53,"n_cols":4,"rows_kept":53,"cut":false,"hidden":false,"merged":[[0,0,0,3]]}
["EG16R DCxxyy U&L"]
["Power (kW)","Engine LS","Power take-off (rpm)","(Nm)"]
[100,800,{"$f":"B3*1.19","v":952},{"$f":"A3*9550/C3","v":1003.1512605042017}]
[100,900,{"$f":"B4*1.19","v":1071},891.6900093370682]
[100,1000,1190,802.52100840336129]
[100,1100,1309,729.56455309396483]
[100,1200,1428,668.76750700280115]
[100,1300,1547,617.32385261797026]
[100,1400,1666,573.2292917166867]
[100,1500,{"$f":"B10*1.19","v":1785},535.0140056022409]
[100,1600,1904,501.57563025210084]
[100,{"$f":"B11+100","v":1700},2023,472.07118141374195]
[100,1800,2142,445.8450046685341]
[100,1900,{"$f":"B14*1.19","v":2261},422.3794781070323]
["Power (kW)","Engine HS","Power take-off (rpm)","(Nm)"]
[100,800,{"$f":"B16*1.53","v":1224},{"$f":"A16*9550/C16","v":780.22875816993462}]
[100,900,{"$f":"B17*1.53","v":1377},693.53667392883074]
[100,1000,1530,624.1830065359477]
[100,1100,1683,567.43909685086157]
[100,1200,1836,520.15250544662308]
[100,{"$f":"B20+100","v":1300},1989,480.14077425842135]
[100,1400,2142,445.8450046685341]
[100,1500,2295,416.12200435729847]
[100,1600,{"$f":"B24*1.53","v":2448},390.11437908496731]
[100,1700,2601,367.16647443291043]
[100,1800,2754,346.76833696441537]
[100,1900,{"$f":"B27*1.53","v":2907},328.51737186102514]
["Power (kW)","Engine LS","Power take-off (rpm)","(Nm)"]
[160,800,{"$f":"B29*1.19","v":952},{"$f":"A29*9550/C29","v":1605.0420168067226}]
[160,900,1071,1426.704014939309]
[160,1000,1190,1284.0336134453783]
[160,1100,1309,1167.3032849503438]
[160,1200,1428,1070.0280112044818]
[160,{"$f":"B33+100","v":1300},1547,987.71816418875244]
[160,1400,1666,917.1668667466987]
[160,1500,1785,856.02240896358546]
[160,1600,1904,802.52100840336129]
[160,1700,2023,755.31389026198713]
[160,1800,2142,713.3520074696545]
[160,1900,{"$f":"B40*1.19","v":2261},675.80716497125161]
["Power (kW)","Engine HS","Power take-off (rpm)","(Nm)"]
[160,800,{"$f":"B42*1.53","v":1224},{"$f":"A42*9550/C42","v":1248.3660130718954}]
[160,900,{"$f":"B43*1.53","v":1377},1109.6586782861293]
[160,1000,{"$f":"B44*1.53","v":1530},998.69281045751632]
[160,1100,1683,907.90255496137854]
[160,1200,1836,{"$f":"A46*9550/C46","v":832.24400871459693}]
[160,1300,1989,{"$f":"A47*9550/C47","v":768.22523881347411}]
[160,1400,2142,713.3520074696545]
[160,1500,2295,665.79520697167754]
[160,1600,2448,624.1830065359477]
[160,{"$f":"B50+100","v":1700},2601,587.46635909265672]
[160,1800,{"$f":"B52*1.53","v":2754},554.82933914306466]
[160,1900,2907,525.62779497764018]

{"sheet":"None","index":77,"n_rows":0,"n_cols":0,"rows_kept":0,"cut":false,"hidden":true,"merged":[]}

{"sheet":"REF","index":78,"n_rows":96,"n_cols":11,"rows_kept":96,"cut":false,"hidden":false,"merged":[]}
["ref","Sheetname",null,"Pro1PowerList","Pro2PowerList","Pro3PowerList",null,"CH"]
[{"$f":"ROW()-1","v":1},{"$f":"IF(OR(IFERROR(INDEX(listsheets,$A2),\"\")=\"REF\",IFERROR(INDEX(listsheets,$A2),\"\")=\"CHART\",$A2=\"\",IFERROR(INDEX(listsheets,$A2),\"\")=\"Gearbox oil cooler\",IFERROR(INDEX(listsheets,$A2),\"\")=\"GEM Startblad\",IFERROR(INDEX(listsheets,$A2),\"\")=\"PTO lathund 3\",IFERROR(INDEX(listsheets,$A2),\"\")=\"PTO Technical data\",IFERROR(INDEX(listsheets,$A2),\"\")=\"Hydraulic pumpdata\",IFERROR(INDEX(listsheets,$A2),\"\")=\"Cranes\",IFERROR(INDEX(listsheets,$A2),\"\")=\"PTO GZ\",IFERROR(INDEX(listsheets,$A2),\"\")=\"EG PTO GW\",IFERROR(INDEX(listsheets,$A2),\"\")=\"EG PTO GW adaption\"),\"\",IFERROR(INDEX(listsheets,$A2),\"\"))","v":"ED70P"},null,{"$f":"IFERROR(INDEX(Pro_1, MATCH(0,COUNTIF($D$1:D1,Pro_1&\"\")+IF(ISTEXT(Pro_1)=TRUE,1,0), 0)), \"\")","v":238},{"$f":"IFERROR(INDEX(Pro_2, MATCH(0,COUNTIF($D$1:E1,Pro_2&\"\")+IF(ISTEXT(Pro_2)=TRUE,1,0), 0)), \"\")","v":100},{"$f":"IFERROR(INDEX(Pro_3, MATCH(0,COUNTIF($D$1:F1,Pro_3&\"\")+IF(ISTEXT(Pro_3)=TRUE,1,0), 0)), \"\")","v":120},null,{"$f":"IFERROR(INDEX(Pro_x, MATCH(0,COUNTIF($H$1:H1,Pro_x&\"\")+IF(ISTEXT(Pro_x)=TRUE,1,0), 0)), \"\")","v":""},null,null,{"$f":"IF(CHART!$B$2=\"None\",\"\",IF(SUM(--(CHART!$B$3=Power__kW_1))=0,\"Choose output power\",\"\"))","v":""}]
[{"$f":"ROW()-1","v":2},{"$f":"IF(OR(IFERROR(INDEX(listsheets,$A3),\"\")=\"REF\",IFERROR(INDEX(listsheets,$A3),\"\")=\"CHART\",$A3=\"\",IFERROR(INDEX(listsheets,$A3),\"\")=\"Gearbox oil cooler\",IFERROR(INDEX(listsheets,$A3),\"\")=\"GEM Startblad\",IFERROR(INDEX(listsheets,$A3),\"\")=\"PTO lathund 3\",IFERROR(INDEX(listsheets,$A3),\"\")=\"PTO Technical data\",IFERROR(INDEX(listsheets,$A3),\"\")=\"Hydraulic pumpdata\",IFERROR(INDEX(listsheets,$A3),\"\")=\"Cranes\",IFERROR(INDEX(listsheets,$A3),\"\")=\"PTO GZ\",IFERROR(INDEX(listsheets,$A3),\"\")=\"EG PTO GW\",IFERROR(INDEX(listsheets,$A3),\"\")=\"EG PTO GW adaption\"),\"\",IFERROR(INDEX(listsheets,$A3),\"\"))","v":"ED120P"},null,{"$f":"IFERROR(INDEX(Pro_1, MATCH(0,COUNTIF($D$1:D2,Pro_1&\"\")+IF(ISTEXT(Pro_1)=TRUE,1,0), 0)), \"\")","v":""},{"$f":"IFERROR(INDEX(Pro_2, MATCH(0,COUNTIF($D$1:E2,Pro_2&\"\")+IF(ISTEXT(Pro_2)=TRUE,1,0), 0)), \"\")","v":160},{"$f":"IFERROR(INDEX(Pro_3, MATCH(0,COUNTIF($D$1:F2,Pro_3&\"\")+IF(ISTEXT(Pro_3)=TRUE,1,0), 0)), \"\")","v":170},null,{"$f":"IFERROR(INDEX(Pro_x, MATCH(0,COUNTIF($H$1:H2,Pro_x&\"\")+IF(ISTEXT(Pro_x)=TRUE,1,0), 0)), \"\")","v":""},null,null,{"$f":"IF(CHART!$D$2=\"None\",\"\",IF(SUM(--(CHART!$D$3=Power__kW_2))=0,\"Choose output power\",\"\"))","v":""}]
[3,{"$f":"IF(OR(IFERROR(INDEX(listsheets,$A4),\"\")=\"REF\",IFERROR(INDEX(listsheets,$A4),\"\")=\"CHART\",$A4=\"\",IFERROR(INDEX(listsheets,$A4),\"\")=\"Gearbox oil cooler\",IFERROR(INDEX(listsheets,$A4),\"\")=\"GEM Startblad\",IFERROR(INDEX(listsheets,$A4),\"\")=\"PTO lathund 3\",IFERROR(INDEX(listsheets,$A4),\"\")=\"PTO Technical data\",IFERROR(INDEX(listsheets,$A4),\"\")=\"Hydraulic pumpdata\",IFERROR(INDEX(listsheets,$A4),\"\")=\"Cranes\",IFERROR(INDEX(listsheets,$A4),\"\")=\"PTO GZ\",IFERROR(INDEX(listsheets,$A4),\"\")=\"EG PTO GW\",IFERROR(INDEX(listsheets,$A4),\"\")=\"EG PTO GW adaption\"),\"\",IFERROR(INDEX(listsheets,$A4),\"\"))","v":"ED160P"},null,{"$f":"IFERROR(INDEX(Pro_1, MATCH(0,COUNTIF($D$1:D3,Pro_1&\"\")+IF(ISTEXT(Pro_1)=TRUE,1,0), 0)), \"\")","v":""},{"$f":"IFERROR(INDEX(Pro_2, MATCH(0,COUNTIF($D$1:E3,Pro_2&\"\")+IF(ISTEXT(Pro_2)=TRUE,1,0), 0)), \"\")","v":""},{"$f":"IFERROR(INDEX(Pro_3, MATCH(0,COUNTIF($D$1:F3,Pro_3&\"\")+IF(ISTEXT(Pro_3)=TRUE,1,0), 0)), \"\")","v":200},null,{"$f":"IFERROR(INDEX(Pro_x, MATCH(0,COUNTIF($H$1:H3,Pro_x&\"\")+IF(ISTEXT(Pro_x)=TRUE,1,0), 0)), \"\")","v":""},null,null,{"$f":"IF(CHART!$F$2=\"None\",\"\",IF(SUM(--(CHART!$F$3=Power__kW_3))=0,\"Choose output power\",\"\"))","v":""}]
[4,{"$f":"IF(OR(IFERROR(INDEX(listsheets,$A5),\"\")=\"REF\",IFERROR(INDEX(listsheets,$A5),\"\")=\"CHART\",$A5=\"\",IFERROR(INDEX(listsheets,$A5),\"\")=\"Gearbox oil cooler\",IFERROR(INDEX(listsheets,$A5),\"\")=\"GEM Startblad\",IFERROR(INDEX(listsheets,$A5),\"\")=\"PTO lathund 3\",IFERROR(INDEX(listsheets,$A5),\"\")=\"PTO Technical data\",IFERROR(INDEX(listsheets,$A5),\"\")=\"Hydraulic pumpdata\",IFERROR(INDEX(listsheets,$A5),\"\")=\"Cranes\",IFERROR(INDEX(listsheets,$A5),\"\")=\"PTO GZ\",IFERROR(INDEX(listsheets,$A5),\"\")=\"EG PTO GW\",IFERROR(INDEX(listsheets,$A5),\"\")=\"EG PTO GW adaption\"),\"\",IFERROR(INDEX(listsheets,$A5),\"\"))","v":"ED10R WBP1"},null,{"$f":"IFERROR(INDEX(Pro_1, MATCH(0,COUNTIF($D$1:D4,Pro_1&\"\")+IF(ISTEXT(Pro_1)=TRUE,1,0), 0)), \"\")","v":""},{"$f":"IFERROR(INDEX(Pro_2, MATCH(0,COUNTIF($D$1:E4,Pro_2&\"\")+IF(ISTEXT(Pro_2)=TRUE,1,0), 0)), \"\")","v":""},{"$f":"IFERROR(INDEX(Pro_3, MATCH(0,COUNTIF($D$1:F4,Pro_3&\"\")+IF(ISTEXT(Pro_3)=TRUE,1,0), 0)), \"\")","v":250},null,{"$f":"IFERROR(INDEX(Pro_x, MATCH(0,COUNTIF($H$1:H4,Pro_x&\"\")+IF(ISTEXT(Pro_x)=TRUE,1,0), 0)), \"\")","v":""}]
[5,{"$f":"IF(OR(IFERROR(INDEX(listsheets,$A6),\"\")=\"REF\",IFERROR(INDEX(listsheets,$A6),\"\")=\"CHART\",$A6=\"\",IFERROR(INDEX(listsheets,$A6),\"\")=\"Gearbox oil cooler\",IFERROR(INDEX(listsheets,$A6),\"\")=\"GEM Startblad\",IFERROR(INDEX(listsheets,$A6),\"\")=\"PTO lathund 3\",IFERROR(INDEX(listsheets,$A6),\"\")=\"PTO Technical data\",IFERROR(INDEX(listsheets,$A6),\"\")=\"Hydraulic pumpdata\",IFERROR(INDEX(listsheets,$A6),\"\")=\"Cranes\",IFERROR(INDEX(listsheets,$A6),\"\")=\"PTO GZ\",IFERROR(INDEX(listsheets,$A6),\"\")=\"EG PTO GW\",IFERROR(INDEX(listsheets,$A6),\"\")=\"EG PTO GW adaption\"),\"\",IFERROR(INDEX(listsheets,$A6),\"\"))","v":"ED10R WBF4"},"GEM Startblad",{"$f":"IFERROR(INDEX(Pro_1, MATCH(0,COUNTIF($D$1:D5,Pro_1&\"\")+IF(ISTEXT(Pro_1)=TRUE,1,0), 0)), \"\")","v":""},{"$f":"IFERROR(INDEX(Pro_2, MATCH(0,COUNTIF($D$1:E5,Pro_2&\"\")+IF(ISTEXT(Pro_2)=TRUE,1,0), 0)), \"\")","v":""},{"$f":"IFERROR(INDEX(Pro_3, MATCH(0,COUNTIF($D$1:F5,Pro_3&\"\")+IF(ISTEXT(Pro_3)=TRUE,1,0), 0)), \"\")","v":""},null,{"$f":"IFERROR(INDEX(Pro_x, MATCH(0,COUNTIF($H$1:H5,Pro_x&\"\")+IF(ISTEXT(Pro_x)=TRUE,1,0), 0)), \"\")","v":""}]
[6,{"$f":"IF(OR(IFERROR(INDEX(listsheets,$A7),\"\")=\"REF\",IFERROR(INDEX(listsheets,$A7),\"\")=\"CHART\",$A7=\"\",IFERROR(INDEX(listsheets,$A7),\"\")=\"Gearbox oil cooler\",IFERROR(INDEX(listsheets,$A7),\"\")=\"GEM Startblad\",IFERROR(INDEX(listsheets,$A7),\"\")=\"PTO lathund 3\",IFERROR(INDEX(listsheets,$A7),\"\")=\"PTO Technical data\",IFERROR(INDEX(listsheets,$A7),\"\")=\"Hydraulic pumpdata\",IFERROR(INDEX(listsheets,$A7),\"\")=\"Cranes\",IFERROR(INDEX(listsheets,$A7),\"\")=\"PTO GZ\",IFERROR(INDEX(listsheets,$A7),\"\")=\"EG PTO GW\",IFERROR(INDEX(listsheets,$A7),\"\")=\"EG PTO GW adaption\"),\"\",IFERROR(INDEX(listsheets,$A7),\"\"))","v":"ED7R WBF3"},"PTO lathund 3",{"$f":"IFERROR(INDEX(Pro_1, MATCH(0,COUNTIF($D$1:D6,Pro_1&\"\")+IF(ISTEXT(Pro_1)=TRUE,1,0), 0)), \"\")","v":""},{"$f":"IFERROR(INDEX(Pro_2, MATCH(0,COUNTIF($D$1:E6,Pro_2&\"\")+IF(ISTEXT(Pro_2)=TRUE,1,0), 0)), \"\")","v":""},{"$f":"IFERROR(INDEX(Pro_3, MATCH(0,COUNTIF($D$1:F6,Pro_3&\"\")+IF(ISTEXT(Pro_3)=TRUE,1,0), 0)), \"\")","v":""},null,{"$f":"IFERROR(INDEX(Pro_x, MATCH(0,COUNTIF($H$1:H6,Pro_x&\"\")+IF(ISTEXT(Pro_x)=TRUE,1,0), 0)), \"\")","v":""}]
[7,"EK730P","PTO Technical data",{"$f":"IFERROR(INDEX(Pro_1, MATCH(0,COUNTIF($D$1:D7,Pro_1&\"\")+IF(ISTEXT(Pro_1)=TRUE,1,0), 0)), \"\")","v":""},{"$f":"IFERROR(INDEX(Pro_2, MATCH(0,COUNTIF($D$1:E7,Pro_2&\"\")+IF(ISTEXT(Pro_2)=TRUE,1,0), 0)), \"\")","v":""},{"$f":"IFERROR(INDEX(Pro_3, MATCH(0,COUNTIF($D$1:F7,Pro_3&\"\")+IF(ISTEXT(Pro_3)=TRUE,1,0), 0)), \"\")","v":""},null,{"$f":"IFERROR(INDEX(Pro_x, MATCH(0,COUNTIF($H$1:H7,Pro_x&\"\")+IF(ISTEXT(Pro_x)=TRUE,1,0), 0)), \"\")","v":""}]
[8,"EK740F","Hydraulic pumpdata"]
[9,"EK750F","Cranes"]
[10,"EG730P","PTO GZ"]
[11,"EG740F","EG PTO GW"]
[12,"EG500P","EG PTO GW adaption"]
[13,"EG500F"]
[14,"EG502P"]
[15,"EG502F"]
[16,"EG501P"]
[17,"EG501F"]
[18,"EG503P"]
[19,"EG503F"]
[20,"EG640F"]
[21,"EG640P"]
[22,"EG641P"]
[23,"EG641F"]
[24,"EG642P"]
[25,"EG642F"]
[26,"EG643P"]
[27,"EG643F"]
[28,"EG644P"]
[29,"EG644F"]
[30,"EG645P"]
[31,"EG645F"]
[32,"EG646P"]
[33,{"$f":"IF(OR(IFERROR(INDEX(listsheets,$A34),\"\")=\"REF\",IFERROR(INDEX(listsheets,$A34),\"\")=\"CHART\",$A34=\"\",IFERROR(INDEX(listsheets,$A34),\"\")=\"Gearbox oil cooler\",IFERROR(INDEX(listsheets,$A34),\"\")=\"GEM Startblad\",IFERROR(INDEX(listsheets,$A34),\"\")=\"PTO lathund 3\",IFERROR(INDEX(listsheets,$A34),\"\")=\"PTO Technical data\",IFERROR(INDEX(listsheets,$A34),\"\")=\"Hydraulic pumpdata\",IFERROR(INDEX(listsheets,$A34),\"\")=\"Cranes\",IFERROR(INDEX(listsheets,$A34),\"\")=\"PTO GZ\",IFERROR(INDEX(listsheets,$A34),\"\")=\"EG PTO GW\",IFERROR(INDEX(listsheets,$A34),\"\")=\"EG PTO GW adaption\"),\"\",IFERROR(INDEX(listsheets,$A34),\"\"))","v":"EG646F"}]
[34,"EG647P"]
[35,"EG647F"]
[36,"EG650P"]
[37,"EG660F"]
[38,"EG651P"]
[39,"EG661F"]
[40,"EG652P"]
[41,"EG662F"]
[42,"EG653P"]
[43,"EG663F"]
[44,"EG670F"]
[45,"EG671F"]
[46,"EG672F"]
[47,"EG670PF U"]
[48,"EG670PF L"]
[49,"EG671PF U"]
[50,"EG671PF L"]
[51,"EG672PF U"]
[52,"EG672PF L"]
[53,"EG670PP U"]
[54,"EG671PP U"]
[55,"EG670PP L"]
[56,"EG671PP L"]
[57,"EG672PP U"]
[58,"EG673PP U"]
[59,"EG672PP L"]
[60,"EG673PP L"]
[61,"EG6R DDxxB"]
[62,"EG8R DCxxB"]
[63,"EG9R DCxxB"]
[64,"EG10R DCxxB"]
[65,{"$f":"IF(OR(IFERROR(INDEX(listsheets,$A66),\"\")=\"REF\",IFERROR(INDEX(listsheets,$A66),\"\")=\"CHART\",$A66=\"\",IFERROR(INDEX(listsheets,$A66),\"\")=\"Gearbox oil cooler\",IFERROR(INDEX(listsheets,$A66),\"\")=\"GEM Startblad\",IFERROR(INDEX(listsheets,$A66),\"\")=\"PTO lathund 3\",IFERROR(INDEX(listsheets,$A66),\"\")=\"PTO Technical data\",IFERROR(INDEX(listsheets,$A66),\"\")=\"Hydraulic pumpdata\",IFERROR(INDEX(listsheets,$A66),\"\")=\"Cranes\",IFERROR(INDEX(listsheets,$A66),\"\")=\"PTO GZ\",IFERROR(INDEX(listsheets,$A66),\"\")=\"EG PTO GW\",IFERROR(INDEX(listsheets,$A66),\"\")=\"EG PTO GW adaption\"),\"\",IFERROR(INDEX(listsheets,$A66),\"\"))","v":"EG25R DAxx"}]
[{"$f":"ROW()-1","v":66},"EG11R DDxxyy U"]
[67,"EG11R DDxxyy L"]
[68,"EG11R DDxxyy L&U"]
[69,"EG12R DCxxyy U"]
[70,"EG12R DCxxyy L"]
[71,"EG12R DCxxyy L&U"]
[72,"EG13R DCxxyy U"]
[73,"EG13R DCxxyy L"]
[74,"EG13R DCxxyy U&L"]
[75,"EG16R DCxxyy U"]
[76,"EG16R DCxxyy L"]
[77,"EG16R DCxxyy U&L"]
[78,"None"]
[79,""]
[null,""]
[null,{"$f":"IF(OR(IFERROR(INDEX(listsheets,$A82),\"\")=\"REF\",IFERROR(INDEX(listsheets,$A82),\"\")=\"CHART\",$A82=\"\",IFERROR(INDEX(listsheets,$A82),\"\")=\"Gearbox oil cooler\",IFERROR(INDEX(listsheets,$A82),\"\")=\"GEM Startblad\",IFERROR(INDEX(listsheets,$A82),\"\")=\"PTO lathund 3\",IFERROR(INDEX(listsheets,$A82),\"\")=\"PTO Technical data\",IFERROR(INDEX(listsheets,$A82),\"\")=\"Hydraulic pumpdata\",IFERROR(INDEX(listsheets,$A82),\"\")=\"Cranes\",IFERROR(INDEX(listsheets,$A82),\"\")=\"PTO GZ\",IFERROR(INDEX(listsheets,$A82),\"\")=\"EG PTO GW\",IFERROR(INDEX(listsheets,$A82),\"\")=\"EG PTO GW adaption\"),\"\",IFERROR(INDEX(listsheets,$A82),\"\"))","v":""}]
[null,{"$f":"IF(OR(IFERROR(INDEX(listsheets,$A83),\"\")=\"REF\",IFERROR(INDEX(listsheets,$A83),\"\")=\"CHART\",$A83=\"\",IFERROR(INDEX(listsheets,$A83),\"\")=\"Gearbox oil cooler\",IFERROR(INDEX(listsheets,$A83),\"\")=\"GEM Startblad\",IFERROR(INDEX(listsheets,$A83),\"\")=\"PTO lathund 3\",IFERROR(INDEX(listsheets,$A83),\"\")=\"PTO Technical data\",IFERROR(INDEX(listsheets,$A83),\"\")=\"Hydraulic pumpdata\",IFERROR(INDEX(listsheets,$A83),\"\")=\"Cranes\",IFERROR(INDEX(listsheets,$A83),\"\")=\"PTO GZ\",IFERROR(INDEX(listsheets,$A83),\"\")=\"EG PTO GW\",IFERROR(INDEX(listsheets,$A83),\"\")=\"EG PTO GW adaption\"),\"\",IFERROR(INDEX(listsheets,$A83),\"\"))","v":""}]
[]
[]
[null,""]
[null,""]
[null,""]
[null,""]
[null,""]
[null,""]
[null,""]
[null,""]
[null,""]
[null,""]
[null,""]

{"sheet":"CHART","index":79,"n_rows":70,"n_cols":38,"rows_kept":70,"cut":false,"hidden":false,"merged":[[0,0,0,5],[23,0,23,4]]}
["PTO Comparison Tool",null,null,null,null,null,4,null,"SS0"]
["PTO 1","ED10R WBP1","PTO 2","EG16R DCxxyy U","PTO 3","EK730P",{"$f":"CHOOSE($G$1,\"HS (rpm)\",\"LS (rpm)\",\"PTO_HS (rpm)\",\"PTO_LS (rpm)\",\"PTO_HS & LS (rpm)\")","v":"PTO_LS (rpm)"}]
["Power (kW)",238,"Power (kW)",100,"Power (kW)",170,null,null,null,{"$f":"IF(ISNUMBER(P3),ROW(),\"\")","v":""},null,null,null,{"$f":"IF(ISNUMBER($P3),ROW(),\"\")","v":""},{"$f":"IF($P3=$C$3,ROW(),\"\")","v":3},{"$f":"IFERROR(INDEX(INDEX(Pro_1,MATCH($B$3,Pro_1,0)-1):INDEX(Pro_1,MATCH(2,1/(Pro_1=$B$3),1)),ROWS(P$2:P2)),\"\")","v":"Power (kW)"},{"$f":"IFERROR(INDEX(INDEX(OFFSET(Pro_1,0,1),MATCH($B$3,Pro_1,0)-1):INDEX(OFFSET(Pro_1,0,1),MATCH(2,1/(Pro_1=$B$3),1)),ROWS(Q$2:Q2)),\"\")","v":"Engine LS"},{"$f":"IFERROR(INDEX(INDEX(OFFSET(Pro_1,0,2),MATCH($B$3,Pro_1,0)-1):INDEX(OFFSET(Pro_1,0,2),MATCH(2,1/(Pro_1=$B$3),1)),ROWS(R$2:R2)),\"\")","v":"Power take-off (rpm)"},{"$f":"IFERROR(INDEX(INDEX(OFFSET(Pro_1,0,3),MATCH($B$3,Pro_1,0)-1):INDEX(OFFSET(Pro_1,0,3),MATCH(2,1/(Pro_1=$B$3),1)),ROWS(S$2:S2)),\"\")","v":"(Nm)"},null,null,null,null,{"$f":"IF(ISNUMBER($Z3),ROW(),\"\")","v":""},{"$f":"IF($Z3=$C$3,ROW(),\"\")","v":3},{"$f":"IFERROR(INDEX(INDEX(Pro_2,MATCH($D$3,Pro_2,0)-1):INDEX(Pro_2,MATCH(2,1/(Pro_2=$D$3),1)),ROWS(Z$2:Z2)),\"\")","v":"Power (kW)"},{"$f":"IFERROR(INDEX(INDEX(OFFSET(Pro_2,0,1),MATCH($D$3,Pro_2,0)-1):INDEX(OFFSET(Pro_2,0,1),MATCH(2,1/(Pro_2=$D$3),1)),ROWS(AA$2:AA2)),\"\")","v":"Engine LS"},{"$f":"IFERROR(INDEX(INDEX(OFFSET(Pro_2,0,2),MATCH($D$3,Pro_2,0)-1):INDEX(OFFSET(Pro_2,0,2),MATCH(2,1/(Pro_2=$D$3),1)),ROWS(AB$2:AB2)),\"\")","v":"Power take-off (rpm)"},{"$f":"IFERROR(INDEX(INDEX(OFFSET(Pro_2,0,3),MATCH($D$3,Pro_2,0)-1):INDEX(OFFSET(Pro_2,0,3),MATCH(2,1/(Pro_2=$D$3),1)),ROWS(AC$2:AC2)),\"\")","v":"(Nm)"},null,null,null,{"$f":"IF(ISNUMBER($AI3),ROW(),\"\")","v":""},{"$f":"IF($AI3=$C$3,ROW(),\"\")","v":3},{"$f":"IFERROR(INDEX(INDEX(Pro_3,MATCH($F$3,Pro_3,0)-1):INDEX(Pro_3,MATCH(2,1/(Pro_3=$F$3),1)),ROWS(AI$2:AI2)),\"\")","v":"Power (kW)"},{"$f":"IFERROR(INDEX(INDEX(OFFSET(Pro_3,0,1),MATCH($F$3,Pro_3,0)-1):INDEX(OFFSET(Pro_3,0,1),MATCH(2,1/(Pro_3=$F$3),1)),ROWS(AJ$2:AJ2)),\"\")","v":"Engine LS"},{"$f":"IFERROR(INDEX(INDEX(OFFSET(Pro_3,0,2),MATCH($F$3,Pro_3,0)-1):INDEX(OFFSET(Pro_3,0,2),MATCH(2,1/(Pro_3=$F$3),1)),ROWS(AK$2:AK2)),\"\")","v":"Power take-off (rpm)"},{"$f":"IFERROR(INDEX(INDEX(OFFSET(Pro_3,0,3),MATCH($F$3,Pro_3,0)-1):INDEX(OFFSET(Pro_3,0,3),MATCH(2,1/(Pro_3=$F$3),1)),ROWS(AL$2:AL2)),\"\")","v":"(Nm)"}]
["Operation type",{"$f":"IFERROR(INDEX(Table1[Operation Type],MATCH(CHART!$B$2&CHART!$B$3,Table1[PTO type]&Table1[Power line (kW)],0),1),\"\")","v":"Continuous"},"Operation type",{"$f":"IFERROR(INDEX(Table1[Operation Type],MATCH(CHART!$D$2&CHART!$D$3,Table1[PTO type]&Table1[Power line (kW)],0),1),\"\")","v":"Continuous"},"Operation type",{"$f":"IFERROR(INDEX(Table1[Operation Type],MATCH(CHART!$F$2&CHART!$F$3,Table1[PTO type]&Table1[Power line (kW)],0),1),\"\")","v":"Periodic (without oil cooler for gearbox), Continuous (with water cooling for gearbox oil)"},null,null,null,null,null,null,null,{"$f":"IF(ISNUMBER($P4),ROW(),\"\")","v":4},"",{"$f":"IFERROR(INDEX(INDEX(Pro_1,MATCH($B$3,Pro_1,0)-1):INDEX(Pro_1,MATCH(2,1/(Pro_1=$B$3),1)),ROWS(P$2:P3)),\"\")","v":238},{"$f":"IFERROR(INDEX(INDEX(OFFSET(Pro_1,0,1),MATCH($B$3,Pro_1,0)-1):INDEX(OFFSET(Pro_1,0,1),MATCH(2,1/(Pro_1=$B$3),1)),ROWS(Q$2:Q3)),\"\")","v":1800},{"$f":"IFERROR(INDEX(INDEX(OFFSET(Pro_1,0,2),MATCH($B$3,Pro_1,0)-1):INDEX(OFFSET(Pro_1,0,2),MATCH(2,1/(Pro_1=$B$3),1)),ROWS(R$2:R3)),\"\")","v":2160},{"$f":"IFERROR(INDEX(INDEX(OFFSET(Pro_1,0,3),MATCH($B$3,Pro_1,0)-1):INDEX(OFFSET(Pro_1,0,3),MATCH(2,1/(Pro_1=$B$3),1)),ROWS(S$2:S3)),\"\")","v":1052.2685185185185},null,null,null,null,{"$f":"IF(ISNUMBER($Z4),ROW(),\"\")","v":4},"",{"$f":"IFERROR(INDEX(INDEX(Pro_2,MATCH($D$3,Pro_2,0)-1):INDEX(Pro_2,MATCH(2,1/(Pro_2=$D$3),1)),ROWS(Z$2:Z3)),\"\")","v":100},{"$f":"IFERROR(INDEX(INDEX(OFFSET(Pro_2,0,1),MATCH($D$3,Pro_2,0)-1):INDEX(OFFSET(Pro_2,0,1),MATCH(2,1/(Pro_2=$D$3),1)),ROWS(AA$2:AA3)),\"\")","v":1300},{"$f":"IFERROR(INDEX(INDEX(OFFSET(Pro_2,0,2),MATCH($D$3,Pro_2,0)-1):INDEX(OFFSET(Pro_2,0,2),MATCH(2,1/(Pro_2=$D$3),1)),ROWS(AB$2:AB3)),\"\")","v":1547},{"$f":"IFERROR(INDEX(INDEX(OFFSET(Pro_2,0,3),MATCH($D$3,Pro_2,0)-1):INDEX(OFFSET(Pro_2,0,3),MATCH(2,1/(Pro_2=$D$3),1)),ROWS(AC$2:AC3)),\"\")","v":617.32385261797026},null,null,null,{"$f":"IF(ISNUMBER($AI4),ROW(),\"\")","v":4},"",{"$f":"IFERROR(INDEX(INDEX(Pro_3,MATCH($F$3,Pro_3,0)-1):INDEX(Pro_3,MATCH(2,1/(Pro_3=$F$3),1)),ROWS(AI$2:AI3)),\"\")","v":170},{"$f":"IFERROR(INDEX(INDEX(OFFSET(Pro_3,0,1),MATCH($F$3,Pro_3,0)-1):INDEX(OFFSET(Pro_3,0,1),MATCH(2,1/(Pro_3=$F$3),1)),ROWS(AJ$2:AJ3)),\"\")","v":800},{"$f":"IFERROR(INDEX(INDEX(OFFSET(Pro_3,0,2),MATCH($F$3,Pro_3,0)-1):INDEX(OFFSET(Pro_3,0,2),MATCH(2,1/(Pro_3=$F$3),1)),ROWS(AK$2:AK3)),\"\")","v":800},{"$f":"IFERROR(INDEX(INDEX(OFFSET(Pro_3,0,3),MATCH($F$3,Pro_3,0)-1):INDEX(OFFSET(Pro_3,0,3),MATCH(2,1/(Pro_3=$F$3),1)),ROWS(AL$2:AL3)),\"\")","v":2029.375}]
[null,{"$f":"REF!$K$2","v":""},null,{"$f":"REF!$K$3","v":""},null,{"$f":"REF!$K$4","v":""},null,null,null,null,null,null,null,5,"",{"$f":"IFERROR(INDEX(INDEX(Pro_1,MATCH($B$3,Pro_1,0)-1):INDEX(Pro_1,MATCH(2,1/(Pro_1=$B$3),1)),ROWS(P$2:P4)),\"\")","v":238},{"$f":"IFERROR(INDEX(INDEX(OFFSET(Pro_1,0,1),MATCH($B$3,Pro_1,0)-1):INDEX(OFFSET(Pro_1,0,1),MATCH(2,1/(Pro_1=$B$3),1)),ROWS(Q$2:Q4)),\"\")","v":1900},{"$f":"IFERROR(INDEX(INDEX(OFFSET(Pro_1,0,2),MATCH($B$3,Pro_1,0)-1):INDEX(OFFSET(Pro_1,0,2),MATCH(2,1/(Pro_1=$B$3),1)),ROWS(R$2:R4)),\"\")","v":2280},{"$f":"IFERROR(INDEX(INDEX(OFFSET(Pro_1,0,3),MATCH($B$3,Pro_1,0)-1):INDEX(OFFSET(Pro_1,0,3),MATCH(2,1/(Pro_1=$B$3),1)),ROWS(S$2:S4)),\"\")","v":996.88596491228066},null,null,null,null,5,"",{"$f":"IFERROR(INDEX(INDEX(Pro_2,MATCH($D$3,Pro_2,0)-1):INDEX(Pro_2,MATCH(2,1/(Pro_2=$D$3),1)),ROWS(Z$2:Z4)),\"\")","v":100},{"$f":"IFERROR(INDEX(INDEX(OFFSET(Pro_2,0,1),MATCH($D$3,Pro_2,0)-1):INDEX(OFFSET(Pro_2,0,1),MATCH(2,1/(Pro_2=$D$3),1)),ROWS(AA$2:AA4)),\"\")","v":1400},{"$f":"IFERROR(INDEX(INDEX(OFFSET(Pro_2,0,2),MATCH($D$3,Pro_2,0)-1):INDEX(OFFSET(Pro_2,0,2),MATCH(2,1/(Pro_2=$D$3),1)),ROWS(AB$2:AB4)),\"\")","v":1666},{"$f":"IFERROR(INDEX(INDEX(OFFSET(Pro_2,0,3),MATCH($D$3,Pro_2,0)-1):INDEX(OFFSET(Pro_2,0,3),MATCH(2,1/(Pro_2=$D$3),1)),ROWS(AC$2:AC4)),\"\")","v":573.2292917166867},null,null,null,5,"",{"$f":"IFERROR(INDEX(INDEX(Pro_3,MATCH($F$3,Pro_3,0)-1):INDEX(Pro_3,MATCH(2,1/(Pro_3=$F$3),1)),ROWS(AI$2:AI4)),\"\")","v":170},{"$f":"IFERROR(INDEX(INDEX(OFFSET(Pro_3,0,1),MATCH($F$3,Pro_3,0)-1):INDEX(OFFSET(Pro_3,0,1),MATCH(2,1/(Pro_3=$F$3),1)),ROWS(AJ$2:AJ4)),\"\")","v":900},{"$f":"IFERROR(INDEX(INDEX(OFFSET(Pro_3,0,2),MATCH($F$3,Pro_3,0)-1):INDEX(OFFSET(Pro_3,0,2),MATCH(2,1/(Pro_3=$F$3),1)),ROWS(AK$2:AK4)),\"\")","v":900},{"$f":"IFERROR(INDEX(INDEX(OFFSET(Pro_3,0,3),MATCH($F$3,Pro_3,0)-1):INDEX(OFFSET(Pro_3,0,3),MATCH(2,1/(Pro_3=$F$3),1)),ROWS(AL$2:AL4)),\"\")","v":1803.8888888888889}]
["Overview",null,"Overview",null,"Overview",null,null,null,null,null,null,null,null,"",6,{"$f":"IFERROR(INDEX(INDEX(Pro_1,MATCH($B$3,Pro_1,0)-1):INDEX(Pro_1,MATCH(2,1/(Pro_1=$B$3),1)),ROWS(P$2:P5)),\"\")","v":"Power (kW)"},{"$f":"IFERROR(INDEX(INDEX(OFFSET(Pro_1,0,1),MATCH($B$3,Pro_1,0)-1):INDEX(OFFSET(Pro_1,0,1),MATCH(2,1/(Pro_1=$B$3),1)),ROWS(Q$2:Q5)),\"\")","v":"Engine HS"},{"$f":"IFERROR(INDEX(INDEX(OFFSET(Pro_1,0,2),MATCH($B$3,Pro_1,0)-1):INDEX(OFFSET(Pro_1,0,2),MATCH(2,1/(Pro_1=$B$3),1)),ROWS(R$2:R5)),\"\")","v":"Power take-off (rpm)"},{"$f":"IFERROR(INDEX(INDEX(OFFSET(Pro_1,0,3),MATCH($B$3,Pro_1,0)-1):INDEX(OFFSET(Pro_1,0,3),MATCH(2,1/(Pro_1=$B$3),1)),ROWS(S$2:S5)),\"\")","v":"(Nm)"},null,null,null,null,6,"",{"$f":"IFERROR(INDEX(INDEX(Pro_2,MATCH($D$3,Pro_2,0)-1):INDEX(Pro_2,MATCH(2,1/(Pro_2=$D$3),1)),ROWS(Z$2:Z5)),\"\")","v":100},{"$f":"IFERROR(INDEX(INDEX(OFFSET(Pro_2,0,1),MATCH($D$3,Pro_2,0)-1):INDEX(OFFSET(Pro_2,0,1),MATCH(2,1/(Pro_2=$D$3),1)),ROWS(AA$2:AA5)),\"\")","v":1500},{"$f":"IFERROR(INDEX(INDEX(OFFSET(Pro_2,0,2),MATCH($D$3,Pro_2,0)-1):INDEX(OFFSET(Pro_2,0,2),MATCH(2,1/(Pro_2=$D$3),1)),ROWS(AB$2:AB5)),\"\")","v":1785},{"$f":"IFERROR(INDEX(INDEX(OFFSET(Pro_2,0,3),MATCH($D$3,Pro_2,0)-1):INDEX(OFFSET(Pro_2,0,3),MATCH(2,1/(Pro_2=$D$3),1)),ROWS(AC$2:AC5)),\"\")","v":535.0140056022409},null,null,null,6,"",{"$f":"IFERROR(INDEX(INDEX(Pro_3,MATCH($F$3,Pro_3,0)-1):INDEX(Pro_3,MATCH(2,1/(Pro_3=$F$3),1)),ROWS(AI$2:AI5)),\"\")","v":170},{"$f":"IFERROR(INDEX(INDEX(OFFSET(Pro_3,0,1),MATCH($F$3,Pro_3,0)-1):INDEX(OFFSET(Pro_3,0,1),MATCH(2,1/(Pro_3=$F$3),1)),ROWS(AJ$2:AJ5)),\"\")","v":1000},{"$f":"IFERROR(INDEX(INDEX(OFFSET(Pro_3,0,2),MATCH($F$3,Pro_3,0)-1):INDEX(OFFSET(Pro_3,0,2),MATCH(2,1/(Pro_3=$F$3),1)),ROWS(AK$2:AK5)),\"\")","v":1000},{"$f":"IFERROR(INDEX(INDEX(OFFSET(Pro_3,0,3),MATCH($F$3,Pro_3,0)-1):INDEX(OFFSET(Pro_3,0,3),MATCH(2,1/(Pro_3=$F$3),1)),ROWS(AL$2:AL5)),\"\")","v":1623.5}]
[null,null,null,null,null,null,null,null,null,null,null,null,null,7,"",{"$f":"IFERROR(INDEX(INDEX(Pro_1,MATCH($B$3,Pro_1,0)-1):INDEX(Pro_1,MATCH(2,1/(Pro_1=$B$3),1)),ROWS(P$2:P6)),\"\")","v":238},{"$f":"IFERROR(INDEX(INDEX(OFFSET(Pro_1,0,1),MATCH($B$3,Pro_1,0)-1):INDEX(OFFSET(Pro_1,0,1),MATCH(2,1/(Pro_1=$B$3),1)),ROWS(Q$2:Q6)),\"\")","v":1800},{"$f":"IFERROR(INDEX(INDEX(OFFSET(Pro_1,0,2),MATCH($B$3,Pro_1,0)-1):INDEX(OFFSET(Pro_1,0,2),MATCH(2,1/(Pro_1=$B$3),1)),ROWS(R$2:R6)),\"\")","v":2160},{"$f":"IFERROR(INDEX(INDEX(OFFSET(Pro_1,0,3),MATCH($B$3,Pro_1,0)-1):INDEX(OFFSET(Pro_1,0,3),MATCH(2,1/(Pro_1=$B$3),1)),ROWS(S$2:S6)),\"\")","v":1052.2685185185185},null,null,null,null,7,"",{"$f":"IFERROR(INDEX(INDEX(Pro_2,MATCH($D$3,Pro_2,0)-1):INDEX(Pro_2,MATCH(2,1/(Pro_2=$D$3),1)),ROWS(Z$2:Z6)),\"\")","v":100},{"$f":"IFERROR(INDEX(INDEX(OFFSET(Pro_2,0,1),MATCH($D$3,Pro_2,0)-1):INDEX(OFFSET(Pro_2,0,1),MATCH(2,1/(Pro_2=$D$3),1)),ROWS(AA$2:AA6)),\"\")","v":1600},{"$f":"IFERROR(INDEX(INDEX(OFFSET(Pro_2,0,2),MATCH($D$3,Pro_2,0)-1):INDEX(OFFSET(Pro_2,0,2),MATCH(2,1/(Pro_2=$D$3),1)),ROWS(AB$2:AB6)),\"\")","v":1904},{"$f":"IFERROR(INDEX(INDEX(OFFSET(Pro_2,0,3),MATCH($D$3,Pro_2,0)-1):INDEX(OFFSET(Pro_2,0,3),MATCH(2,1/(Pro_2=$D$3),1)),ROWS(AC$2:AC6)),\"\")","v":501.57563025210084},null,null,null,7,"",{"$f":"IFERROR(INDEX(INDEX(Pro_3,MATCH($F$3,Pro_3,0)-1):INDEX(Pro_3,MATCH(2,1/(Pro_3=$F$3),1)),ROWS(AI$2:AI6)),\"\")","v":170},{"$f":"IFERROR(INDEX(INDEX(OFFSET(Pro_3,0,1),MATCH($F$3,Pro_3,0)-1):INDEX(OFFSET(Pro_3,0,1),MATCH(2,1/(Pro_3=$F$3),1)),ROWS(AJ$2:AJ6)),\"\")","v":1100},{"$f":"IFERROR(INDEX(INDEX(OFFSET(Pro_3,0,2),MATCH($F$3,Pro_3,0)-1):INDEX(OFFSET(Pro_3,0,2),MATCH(2,1/(Pro_3=$F$3),1)),ROWS(AK$2:AK6)),\"\")","v":1100},{"$f":"IFERROR(INDEX(INDEX(OFFSET(Pro_3,0,3),MATCH($F$3,Pro_3,0)-1):INDEX(OFFSET(Pro_3,0,3),MATCH(2,1/(Pro_3=$F$3),1)),ROWS(AL$2:AL6)),\"\")","v":1475.909090909091}]
[null,null,null,null,null,null,null,null,null,null,null,null,null,8,"",{"$f":"IFERROR(INDEX(INDEX(Pro_1,MATCH($B$3,Pro_1,0)-1):INDEX(Pro_1,MATCH(2,1/(Pro_1=$B$3),1)),ROWS(P$2:P7)),\"\")","v":238},{"$f":"IFERROR(INDEX(INDEX(OFFSET(Pro_1,0,1),MATCH($B$3,Pro_1,0)-1):INDEX(OFFSET(Pro_1,0,1),MATCH(2,1/(Pro_1=$B$3),1)),ROWS(Q$2:Q7)),\"\")","v":1900},{"$f":"IFERROR(INDEX(INDEX(OFFSET(Pro_1,0,2),MATCH($B$3,Pro_1,0)-1):INDEX(OFFSET(Pro_1,0,2),MATCH(2,1/(Pro_1=$B$3),1)),ROWS(R$2:R7)),\"\")","v":2280},{"$f":"IFERROR(INDEX(INDEX(OFFSET(Pro_1,0,3),MATCH($B$3,Pro_1,0)-1):INDEX(OFFSET(Pro_1,0,3),MATCH(2,1/(Pro_1=$B$3),1)),ROWS(S$2:S7)),\"\")","v":996.88596491228066},null,null,null,null,8,"",{"$f":"IFERROR(INDEX(INDEX(Pro_2,MATCH($D$3,Pro_2,0)-1):INDEX(Pro_2,MATCH(2,1/(Pro_2=$D$3),1)),ROWS(Z$2:Z7)),\"\")","v":100},{"$f":"IFERROR(INDEX(INDEX(OFFSET(Pro_2,0,1),MATCH($D$3,Pro_2,0)-1):INDEX(OFFSET(Pro_2,0,1),MATCH(2,1/(Pro_2=$D$3),1)),ROWS(AA$2:AA7)),\"\")","v":1700},{"$f":"IFERROR(INDEX(INDEX(OFFSET(Pro_2,0,2),MATCH($D$3,Pro_2,0)-1):INDEX(OFFSET(Pro_2,0,2),MATCH(2,1/(Pro_2=$D$3),1)),ROWS(AB$2:AB7)),\"\")","v":2023},{"$f":"IFERROR(INDEX(INDEX(OFFSET(Pro_2,0,3),MATCH($D$3,Pro_2,0)-1):INDEX(OFFSET(Pro_2,0,3),MATCH(2,1/(Pro_2=$D$3),1)),ROWS(AC$2:AC7)),\"\")","v":472.07118141374195},null,null,null,8,"",{"$f":"IFERROR(INDEX(INDEX(Pro_3,MATCH($F$3,Pro_3,0)-1):INDEX(Pro_3,MATCH(2,1/(Pro_3=$F$3),1)),ROWS(AI$2:AI7)),\"\")","v":170},{"$f":"IFERROR(INDEX(INDEX(OFFSET(Pro_3,0,1),MATCH($F$3,Pro_3,0)-1):INDEX(OFFSET(Pro_3,0,1),MATCH(2,1/(Pro_3=$F$3),1)),ROWS(AJ$2:AJ7)),\"\")","v":1200},{"$f":"IFERROR(INDEX(INDEX(OFFSET(Pro_3,0,2),MATCH($F$3,Pro_3,0)-1):INDEX(OFFSET(Pro_3,0,2),MATCH(2,1/(Pro_3=$F$3),1)),ROWS(AK$2:AK7)),\"\")","v":1200},{"$f":"IFERROR(INDEX(INDEX(OFFSET(Pro_3,0,3),MATCH($F$3,Pro_3,0)-1):INDEX(OFFSET(Pro_3,0,3),MATCH(2,1/(Pro_3=$F$3),1)),ROWS(AL$2:AL7)),\"\")","v":1352.9166666666667}]
[null,null,null,null,null,null,null,null,null,null,null,null,null,"","",{"$f":"IFERROR(INDEX(INDEX(Pro_1,MATCH($B$3,Pro_1,0)-1):INDEX(Pro_1,MATCH(2,1/(Pro_1=$B$3),1)),ROWS(P$2:P8)),\"\")","v":""},{"$f":"IFERROR(INDEX(INDEX(OFFSET(Pro_1,0,1),MATCH($B$3,Pro_1,0)-1):INDEX(OFFSET(Pro_1,0,1),MATCH(2,1/(Pro_1=$B$3),1)),ROWS(Q$2:Q8)),\"\")","v":""},{"$f":"IFERROR(INDEX(INDEX(OFFSET(Pro_1,0,2),MATCH($B$3,Pro_1,0)-1):INDEX(OFFSET(Pro_1,0,2),MATCH(2,1/(Pro_1=$B$3),1)),ROWS(R$2:R8)),\"\")","v":""},{"$f":"IFERROR(INDEX(INDEX(OFFSET(Pro_1,0,3),MATCH($B$3,Pro_1,0)-1):INDEX(OFFSET(Pro_1,0,3),MATCH(2,1/(Pro_1=$B$3),1)),ROWS(S$2:S8)),\"\")","v":""},null,null,null,null,9,"",{"$f":"IFERROR(INDEX(INDEX(Pro_2,MATCH($D$3,Pro_2,0)-1):INDEX(Pro_2,MATCH(2,1/(Pro_2=$D$3),1)),ROWS(Z$2:Z8)),\"\")","v":100},{"$f":"IFERROR(INDEX(INDEX(OFFSET(Pro_2,0,1),MATCH($D$3,Pro_2,0)-1):INDEX(OFFSET(Pro_2,0,1),MATCH(2,1/(Pro_2=$D$3),1)),ROWS(AA$2:AA8)),\"\")","v":1800},{"$f":"IFERROR(INDEX(INDEX(OFFSET(Pro_2,0,2),MATCH($D$3,Pro_2,0)-1):INDEX(OFFSET(Pro_2,0,2),MATCH(2,1/(Pro_2=$D$3),1)),ROWS(AB$2:AB8)),\"\")","v":2142},{"$f":"IFERROR(INDEX(INDEX(OFFSET(Pro_2,0,3),MATCH($D$3,Pro_2,0)-1):INDEX(OFFSET(Pro_2,0,3),MATCH(2,1/(Pro_2=$D$3),1)),ROWS(AC$2:AC8)),\"\")","v":445.8450046685341},null,null,null,9,"",{"$f":"IFERROR(INDEX(INDEX(Pro_3,MATCH($F$3,Pro_3,0)-1):INDEX(Pro_3,MATCH(2,1/(Pro_3=$F$3),1)),ROWS(AI$2:AI8)),\"\")","v":170},{"$f":"IFERROR(INDEX(INDEX(OFFSET(Pro_3,0,1),MATCH($F$3,Pro_3,0)-1):INDEX(OFFSET(Pro_3,0,1),MATCH(2,1/(Pro_3=$F$3),1)),ROWS(AJ$2:AJ8)),\"\")","v":1300},{"$f":"IFERROR(INDEX(INDEX(OFFSET(Pro_3,0,2),MATCH($F$3,Pro_3,0)-1):INDEX(OFFSET(Pro_3,0,2),MATCH(2,1/(Pro_3=$F$3),1)),ROWS(AK$2:AK8)),\"\")","v":1300},{"$f":"IFERROR(INDEX(INDEX(OFFSET(Pro_3,0,3),MATCH($F$3,Pro_3,0)-1):INDEX(OFFSET(Pro_3,0,3),MATCH(2,1/(Pro_3=$F$3),1)),ROWS(AL$2:AL8)),\"\")","v":1248.8461538461538}]
[null,null,null,null,null,null,null,null,null,null,null,null,null,"","",{"$f":"IFERROR(INDEX(INDEX(Pro_1,MATCH($B$3,Pro_1,0)-1):INDEX(Pro_1,MATCH(2,1/(Pro_1=$B$3),1)),ROWS(P$2:P9)),\"\")","v":""},{"$f":"IFERROR(INDEX(INDEX(OFFSET(Pro_1,0,1),MATCH($B$3,Pro_1,0)-1):INDEX(OFFSET(Pro_1,0,1),MATCH(2,1/(Pro_1=$B$3),1)),ROWS(Q$2:Q9)),\"\")","v":""},{"$f":"IFERROR(INDEX(INDEX(OFFSET(Pro_1,0,2),MATCH($B$3,Pro_1,0)-1):INDEX(OFFSET(Pro_1,0,2),MATCH(2,1/(Pro_1=$B$3),1)),ROWS(R$2:R9)),\"\")","v":""},{"$f":"IFERROR(INDEX(INDEX(OFFSET(Pro_1,0,3),MATCH($B$3,Pro_1,0)-1):INDEX(OFFSET(Pro_1,0,3),MATCH(2,1/(Pro_1=$B$3),1)),ROWS(S$2:S9)),\"\")","v":""},null,null,null,null,10,"",{"$f":"IFERROR(INDEX(INDEX(Pro_2,MATCH($D$3,Pro_2,0)-1):INDEX(Pro_2,MATCH(2,1/(Pro_2=$D$3),1)),ROWS(Z$2:Z9)),\"\")","v":100},{"$f":"IFERROR(INDEX(INDEX(OFFSET(Pro_2,0,1),MATCH($D$3,Pro_2,0)-1):INDEX(OFFSET(Pro_2,0,1),MATCH(2,1/(Pro_2=$D$3),1)),ROWS(AA$2:AA9)),\"\")","v":1900},{"$f":"IFERROR(INDEX(INDEX(OFFSET(Pro_2,0,2),MATCH($D$3,Pro_2,0)-1):INDEX(OFFSET(Pro_2,0,2),MATCH(2,1/(Pro_2=$D$3),1)),ROWS(AB$2:AB9)),\"\")","v":2261},{"$f":"IFERROR(INDEX(INDEX(OFFSET(Pro_2,0,3),MATCH($D$3,Pro_2,0)-1):INDEX(OFFSET(Pro_2,0,3),MATCH(2,1/(Pro_2=$D$3),1)),ROWS(AC$2:AC9)),\"\")","v":422.3794781070323},null,null,null,10,"",{"$f":"IFERROR(INDEX(INDEX(Pro_3,MATCH($F$3,Pro_3,0)-1):INDEX(Pro_3,MATCH(2,1/(Pro_3=$F$3),1)),ROWS(AI$2:AI9)),\"\")","v":170},{"$f":"IFERROR(INDEX(INDEX(OFFSET(Pro_3,0,1),MATCH($F$3,Pro_3,0)-1):INDEX(OFFSET(Pro_3,0,1),MATCH(2,1/(Pro_3=$F$3),1)),ROWS(AJ$2:AJ9)),\"\")","v":1400},{"$f":"IFERROR(INDEX(INDEX(OFFSET(Pro_3,0,2),MATCH($F$3,Pro_3,0)-1):INDEX(OFFSET(Pro_3,0,2),MATCH(2,1/(Pro_3=$F$3),1)),ROWS(AK$2:AK9)),\"\")","v":1400},{"$f":"IFERROR(INDEX(INDEX(OFFSET(Pro_3,0,3),MATCH($F$3,Pro_3,0)-1):INDEX(OFFSET(Pro_3,0,3),MATCH(2,1/(Pro_3=$F$3),1)),ROWS(AL$2:AL9)),\"\")","v":1159.6428571428571}]
[null,null,null,null,null,null,null,null,null,null,null,null,null,"","",{"$f":"IFERROR(INDEX(INDEX(Pro_1,MATCH($B$3,Pro_1,0)-1):INDEX(Pro_1,MATCH(2,1/(Pro_1=$B$3),1)),ROWS(P$2:P10)),\"\")","v":""},{"$f":"IFERROR(INDEX(INDEX(OFFSET(Pro_1,0,1),MATCH($B$3,Pro_1,0)-1):INDEX(OFFSET(Pro_1,0,1),MATCH(2,1/(Pro_1=$B$3),1)),ROWS(Q$2:Q10)),\"\")","v":""},{"$f":"IFERROR(INDEX(INDEX(OFFSET(Pro_1,0,2),MATCH($B$3,Pro_1,0)-1):INDEX(OFFSET(Pro_1,0,2),MATCH(2,1/(Pro_1=$B$3),1)),ROWS(R$2:R10)),\"\")","v":""},{"$f":"IFERROR(INDEX(INDEX(OFFSET(Pro_1,0,3),MATCH($B$3,Pro_1,0)-1):INDEX(OFFSET(Pro_1,0,3),MATCH(2,1/(Pro_1=$B$3),1)),ROWS(S$2:S10)),\"\")","v":""},null,null,null,null,"",11,{"$f":"IFERROR(INDEX(INDEX(Pro_2,MATCH($D$3,Pro_2,0)-1):INDEX(Pro_2,MATCH(2,1/(Pro_2=$D$3),1)),ROWS(Z$2:Z10)),\"\")","v":"Power (kW)"},{"$f":"IFERROR(INDEX(INDEX(OFFSET(Pro_2,0,1),MATCH($D$3,Pro_2,0)-1):INDEX(OFFSET(Pro_2,0,1),MATCH(2,1/(Pro_2=$D$3),1)),ROWS(AA$2:AA10)),\"\")","v":"Engine HS"},{"$f":"IFERROR(INDEX(INDEX(OFFSET(Pro_2,0,2),MATCH($D$3,Pro_2,0)-1):INDEX(OFFSET(Pro_2,0,2),MATCH(2,1/(Pro_2=$D$3),1)),ROWS(AB$2:AB10)),\"\")","v":"Power take-off (rpm)"},{"$f":"IFERROR(INDEX(INDEX(OFFSET(Pro_2,0,3),MATCH($D$3,Pro_2,0)-1):INDEX(OFFSET(Pro_2,0,3),MATCH(2,1/(Pro_2=$D$3),1)),ROWS(AC$2:AC10)),\"\")","v":"(Nm)"},null,null,null,11,"",{"$f":"IFERROR(INDEX(INDEX(Pro_3,MATCH($F$3,Pro_3,0)-1):INDEX(Pro_3,MATCH(2,1/(Pro_3=$F$3),1)),ROWS(AI$2:AI10)),\"\")","v":170},{"$f":"IFERROR(INDEX(INDEX(OFFSET(Pro_3,0,1),MATCH($F$3,Pro_3,0)-1):INDEX(OFFSET(Pro_3,0,1),MATCH(2,1/(Pro_3=$F$3),1)),ROWS(AJ$2:AJ10)),\"\")","v":1500},{"$f":"IFERROR(INDEX(INDEX(OFFSET(Pro_3,0,2),MATCH($F$3,Pro_3,0)-1):INDEX(OFFSET(Pro_3,0,2),MATCH(2,1/(Pro_3=$F$3),1)),ROWS(AK$2:AK10)),\"\")","v":1500},{"$f":"IFERROR(INDEX(INDEX(OFFSET(Pro_3,0,3),MATCH($F$3,Pro_3,0)-1):INDEX(OFFSET(Pro_3,0,3),MATCH(2,1/(Pro_3=$F$3),1)),ROWS(AL$2:AL10)),\"\")","v":1082.3333333333333}]
[null,null,null,null,null,null,null,null,null,null,null,null,null,"","",{"$f":"IFERROR(INDEX(INDEX(Pro_1,MATCH($B$3,Pro_1,0)-1):INDEX(Pro_1,MATCH(2,1/(Pro_1=$B$3),1)),ROWS(P$2:P11)),\"\")","v":""},{"$f":"IFERROR(INDEX(INDEX(OFFSET(Pro_1,0,1),MATCH($B$3,Pro_1,0)-1):INDEX(OFFSET(Pro_1,0,1),MATCH(2,1/(Pro_1=$B$3),1)),ROWS(Q$2:Q11)),\"\")","v":""},{"$f":"IFERROR(INDEX(INDEX(OFFSET(Pro_1,0,2),MATCH($B$3,Pro_1,0)-1):INDEX(OFFSET(Pro_1,0,2),MATCH(2,1/(Pro_1=$B$3),1)),ROWS(R$2:R11)),\"\")","v":""},{"$f":"IFERROR(INDEX(INDEX(OFFSET(Pro_1,0,3),MATCH($B$3,Pro_1,0)-1):INDEX(OFFSET(Pro_1,0,3),MATCH(2,1/(Pro_1=$B$3),1)),ROWS(S$2:S11)),\"\")","v":""},null,null,null,null,12,"",{"$f":"IFERROR(INDEX(INDEX(Pro_2,MATCH($D$3,Pro_2,0)-1):INDEX(Pro_2,MATCH(2,1/(Pro_2=$D$3),1)),ROWS(Z$2:Z11)),\"\")","v":100},{"$f":"IFERROR(INDEX(INDEX(OFFSET(Pro_2,0,1),MATCH($D$3,Pro_2,0)-1):INDEX(OFFSET(Pro_2,0,1),MATCH(2,1/(Pro_2=$D$3),1)),ROWS(AA$2:AA11)),\"\")","v":1000},{"$f":"IFERROR(INDEX(INDEX(OFFSET(Pro_2,0,2),MATCH($D$3,Pro_2,0)-1):INDEX(OFFSET(Pro_2,0,2),MATCH(2,1/(Pro_2=$D$3),1)),ROWS(AB$2:AB11)),\"\")","v":1530},{"$f":"IFERROR(INDEX(INDEX(OFFSET(Pro_2,0,3),MATCH($D$3,Pro_2,0)-1):INDEX(OFFSET(Pro_2,0,3),MATCH(2,1/(Pro_2=$D$3),1)),ROWS(AC$2:AC11)),\"\")","v":624.1830065359477},null,null,null,12,"",{"$f":"IFERROR(INDEX(INDEX(Pro_3,MATCH($F$3,Pro_3,0)-1):INDEX(Pro_3,MATCH(2,1/(Pro_3=$F$3),1)),ROWS(AI$2:AI11)),\"\")","v":170},{"$f":"IFERROR(INDEX(INDEX(OFFSET(Pro_3,0,1),MATCH($F$3,Pro_3,0)-1):INDEX(OFFSET(Pro_3,0,1),MATCH(2,1/(Pro_3=$F$3),1)),ROWS(AJ$2:AJ11)),\"\")","v":1600},{"$f":"IFERROR(INDEX(INDEX(OFFSET(Pro_3,0,2),MATCH($F$3,Pro_3,0)-1):INDEX(OFFSET(Pro_3,0,2),MATCH(2,1/(Pro_3=$F$3),1)),ROWS(AK$2:AK11)),\"\")","v":1600},{"$f":"IFERROR(INDEX(INDEX(OFFSET(Pro_3,0,3),MATCH($F$3,Pro_3,0)-1):INDEX(OFFSET(Pro_3,0,3),MATCH(2,1/(Pro_3=$F$3),1)),ROWS(AL$2:AL11)),\"\")","v":1014.6875}]
[null,null,null,null,null,null,null,null,null,null,null,null,null,"","",{"$f":"IFERROR(INDEX(INDEX(Pro_1,MATCH($B$3,Pro_1,0)-1):INDEX(Pro_1,MATCH(2,1/(Pro_1=$B$3),1)),ROWS(P$2:P12)),\"\")","v":""},{"$f":"IFERROR(INDEX(INDEX(OFFSET(Pro_1,0,1),MATCH($B$3,Pro_1,0)-1):INDEX(OFFSET(Pro_1,0,1),MATCH(2,1/(Pro_1=$B$3),1)),ROWS(Q$2:Q12)),\"\")","v":""},{"$f":"IFERROR(INDEX(INDEX(OFFSET(Pro_1,0,2),MATCH($B$3,Pro_1,0)-1):INDEX(OFFSET(Pro_1,0,2),MATCH(2,1/(Pro_1=$B$3),1)),ROWS(R$2:R12)),\"\")","v":""},{"$f":"IFERROR(INDEX(INDEX(OFFSET(Pro_1,0,3),MATCH($B$3,Pro_1,0)-1):INDEX(OFFSET(Pro_1,0,3),MATCH(2,1/(Pro_1=$B$3),1)),ROWS(S$2:S12)),\"\")","v":""},null,null,null,null,13,"",{"$f":"IFERROR(INDEX(INDEX(Pro_2,MATCH($D$3,Pro_2,0)-1):INDEX(Pro_2,MATCH(2,1/(Pro_2=$D$3),1)),ROWS(Z$2:Z12)),\"\")","v":100},{"$f":"IFERROR(INDEX(INDEX(OFFSET(Pro_2,0,1),MATCH($D$3,Pro_2,0)-1):INDEX(OFFSET(Pro_2,0,1),MATCH(2,1/(Pro_2=$D$3),1)),ROWS(AA$2:AA12)),\"\")","v":1100},{"$f":"IFERROR(INDEX(INDEX(OFFSET(Pro_2,0,2),MATCH($D$3,Pro_2,0)-1):INDEX(OFFSET(Pro_2,0,2),MATCH(2,1/(Pro_2=$D$3),1)),ROWS(AB$2:AB12)),\"\")","v":1683},{"$f":"IFERROR(INDEX(INDEX(OFFSET(Pro_2,0,3),MATCH($D$3,Pro_2,0)-1):INDEX(OFFSET(Pro_2,0,3),MATCH(2,1/(Pro_2=$D$3),1)),ROWS(AC$2:AC12)),\"\")","v":567.43909685086157},null,null,null,13,"",{"$f":"IFERROR(INDEX(INDEX(Pro_3,MATCH($F$3,Pro_3,0)-1):INDEX(Pro_3,MATCH(2,1/(Pro_3=$F$3),1)),ROWS(AI$2:AI12)),\"\")","v":170},{"$f":"IFERROR(INDEX(INDEX(OFFSET(Pro_3,0,1),MATCH($F$3,Pro_3,0)-1):INDEX(OFFSET(Pro_3,0,1),MATCH(2,1/(Pro_3=$F$3),1)),ROWS(AJ$2:AJ12)),\"\")","v":1700},{"$f":"IFERROR(INDEX(INDEX(OFFSET(Pro_3,0,2),MATCH($F$3,Pro_3,0)-1):INDEX(OFFSET(Pro_3,0,2),MATCH(2,1/(Pro_3=$F$3),1)),ROWS(AK$2:AK12)),\"\")","v":1700},{"$f":"IFERROR(INDEX(INDEX(OFFSET(Pro_3,0,3),MATCH($F$3,Pro_3,0)-1):INDEX(OFFSET(Pro_3,0,3),MATCH(2,1/(Pro_3=$F$3),1)),ROWS(AL$2:AL12)),\"\")","v":955}]
[null,null,null,null,null,null,null,null,null,null,null,null,null,"","",{"$f":"IFERROR(INDEX(INDEX(Pro_1,MATCH($B$3,Pro_1,0)-1):INDEX(Pro_1,MATCH(2,1/(Pro_1=$B$3),1)),ROWS(P$2:P13)),\"\")","v":""},{"$f":"IFERROR(INDEX(INDEX(OFFSET(Pro_1,0,1),MATCH($B$3,Pro_1,0)-1):INDEX(OFFSET(Pro_1,0,1),MATCH(2,1/(Pro_1=$B$3),1)),ROWS(Q$2:Q13)),\"\")","v":""},{"$f":"IFERROR(INDEX(INDEX(OFFSET(Pro_1,0,2),MATCH($B$3,Pro_1,0)-1):INDEX(OFFSET(Pro_1,0,2),MATCH(2,1/(Pro_1=$B$3),1)),ROWS(R$2:R13)),\"\")","v":""},{"$f":"IFERROR(INDEX(INDEX(OFFSET(Pro_1,0,3),MATCH($B$3,Pro_1,0)-1):INDEX(OFFSET(Pro_1,0,3),MATCH(2,1/(Pro_1=$B$3),1)),ROWS(S$2:S13)),\"\")","v":""},null,null,null,null,14,"",{"$f":"IFERROR(INDEX(INDEX(Pro_2,MATCH($D$3,Pro_2,0)-1):INDEX(Pro_2,MATCH(2,1/(Pro_2=$D$3),1)),ROWS(Z$2:Z13)),\"\")","v":100},{"$f":"IFERROR(INDEX(INDEX(OFFSET(Pro_2,0,1),MATCH($D$3,Pro_2,0)-1):INDEX(OFFSET(Pro_2,0,1),MATCH(2,1/(Pro_2=$D$3),1)),ROWS(AA$2:AA13)),\"\")","v":1200},{"$f":"IFERROR(INDEX(INDEX(OFFSET(Pro_2,0,2),MATCH($D$3,Pro_2,0)-1):INDEX(OFFSET(Pro_2,0,2),MATCH(2,1/(Pro_2=$D$3),1)),ROWS(AB$2:AB13)),\"\")","v":1836},{"$f":"IFERROR(INDEX(INDEX(OFFSET(Pro_2,0,3),MATCH($D$3,Pro_2,0)-1):INDEX(OFFSET(Pro_2,0,3),MATCH(2,1/(Pro_2=$D$3),1)),ROWS(AC$2:AC13)),\"\")","v":520.15250544662308},null,null,null,14,"",{"$f":"IFERROR(INDEX(INDEX(Pro_3,MATCH($F$3,Pro_3,0)-1):INDEX(Pro_3,MATCH(2,1/(Pro_3=$F$3),1)),ROWS(AI$2:AI13)),\"\")","v":170},{"$f":"IFERROR(INDEX(INDEX(OFFSET(Pro_3,0,1),MATCH($F$3,Pro_3,0)-1):INDEX(OFFSET(Pro_3,0,1),MATCH(2,1/(Pro_3=$F$3),1)),ROWS(AJ$2:AJ13)),\"\")","v":1800},{"$f":"IFERROR(INDEX(INDEX(OFFSET(Pro_3,0,2),MATCH($F$3,Pro_3,0)-1):INDEX(OFFSET(Pro_3,0,2),MATCH(2,1/(Pro_3=$F$3),1)),ROWS(AK$2:AK13)),\"\")","v":1800},{"$f":"IFERROR(INDEX(INDEX(OFFSET(Pro_3,0,3),MATCH($F$3,Pro_3,0)-1):INDEX(OFFSET(Pro_3,0,3),MATCH(2,1/(Pro_3=$F$3),1)),ROWS(AL$2:AL13)),\"\")","v":901.94444444444446}]
[null,null,null,null,null,null,null,null,null,null,null,null,null,"","",{"$f":"IFERROR(INDEX(INDEX(Pro_1,MATCH($B$3,Pro_1,0)-1):INDEX(Pro_1,MATCH(2,1/(Pro_1=$B$3),1)),ROWS(P$2:P14)),\"\")","v":""},{"$f":"IFERROR(INDEX(INDEX(OFFSET(Pro_1,0,1),MATCH($B$3,Pro_1,0)-1):INDEX(OFFSET(Pro_1,0,1),MATCH(2,1/(Pro_1=$B$3),1)),ROWS(Q$2:Q14)),\"\")","v":""},{"$f":"IFERROR(INDEX(INDEX(OFFSET(Pro_1,0,2),MATCH($B$3,Pro_1,0)-1):INDEX(OFFSET(Pro_1,0,2),MATCH(2,1/(Pro_1=$B$3),1)),ROWS(R$2:R14)),\"\")","v":""},{"$f":"IFERROR(INDEX(INDEX(OFFSET(Pro_1,0,3),MATCH($B$3,Pro_1,0)-1):INDEX(OFFSET(Pro_1,0,3),MATCH(2,1/(Pro_1=$B$3),1)),ROWS(S$2:S14)),\"\")","v":""},null,null,null,null,15,"",{"$f":"IFERROR(INDEX(INDEX(Pro_2,MATCH($D$3,Pro_2,0)-1):INDEX(Pro_2,MATCH(2,1/(Pro_2=$D$3),1)),ROWS(Z$2:Z14)),\"\")","v":100},{"$f":"IFERROR(INDEX(INDEX(OFFSET(Pro_2,0,1),MATCH($D$3,Pro_2,0)-1):INDEX(OFFSET(Pro_2,0,1),MATCH(2,1/(Pro_2=$D$3),1)),ROWS(AA$2:AA14)),\"\")","v":1300},{"$f":"IFERROR(INDEX(INDEX(OFFSET(Pro_2,0,2),MATCH($D$3,Pro_2,0)-1):INDEX(OFFSET(Pro_2,0,2),MATCH(2,1/(Pro_2=$D$3),1)),ROWS(AB$2:AB14)),\"\")","v":1989},{"$f":"IFERROR(INDEX(INDEX(OFFSET(Pro_2,0,3),MATCH($D$3,Pro_2,0)-1):INDEX(OFFSET(Pro_2,0,3),MATCH(2,1/(Pro_2=$D$3),1)),ROWS(AC$2:AC14)),\"\")","v":480.14077425842135},null,null,null,15,"",{"$f":"IFERROR(INDEX(INDEX(Pro_3,MATCH($F$3,Pro_3,0)-1):INDEX(Pro_3,MATCH(2,1/(Pro_3=$F$3),1)),ROWS(AI$2:AI14)),\"\")","v":170},{"$f":"IFERROR(INDEX(INDEX(OFFSET(Pro_3,0,1),MATCH($F$3,Pro_3,0)-1):INDEX(OFFSET(Pro_3,0,1),MATCH(2,1/(Pro_3=$F$3),1)),ROWS(AJ$2:AJ14)),\"\")","v":1900},{"$f":"IFERROR(INDEX(INDEX(OFFSET(Pro_3,0,2),MATCH($F$3,Pro_3,0)-1):INDEX(OFFSET(Pro_3,0,2),MATCH(2,1/(Pro_3=$F$3),1)),ROWS(AK$2:AK14)),\"\")","v":1900},{"$f":"IFERROR(INDEX(INDEX(OFFSET(Pro_3,0,3),MATCH($F$3,Pro_3,0)-1):INDEX(OFFSET(Pro_3,0,3),MATCH(2,1/(Pro_3=$F$3),1)),ROWS(AL$2:AL14)),\"\")","v":854.47368421052636}]
[null,null,null,null,null,null,null,null,null,null,null,null,null,"","",{"$f":"IFERROR(INDEX(INDEX(Pro_1,MATCH($B$3,Pro_1,0)-1):INDEX(Pro_1,MATCH(2,1/(Pro_1=$B$3),1)),ROWS(P$2:P15)),\"\")","v":""},{"$f":"IFERROR(INDEX(INDEX(OFFSET(Pro_1,0,1),MATCH($B$3,Pro_1,0)-1):INDEX(OFFSET(Pro_1,0,1),MATCH(2,1/(Pro_1=$B$3),1)),ROWS(Q$2:Q15)),\"\")","v":""},{"$f":"IFERROR(INDEX(INDEX(OFFSET(Pro_1,0,2),MATCH($B$3,Pro_1,0)-1):INDEX(OFFSET(Pro_1,0,2),MATCH(2,1/(Pro_1=$B$3),1)),ROWS(R$2:R15)),\"\")","v":""},{"$f":"IFERROR(INDEX(INDEX(OFFSET(Pro_1,0,3),MATCH($B$3,Pro_1,0)-1):INDEX(OFFSET(Pro_1,0,3),MATCH(2,1/(Pro_1=$B$3),1)),ROWS(S$2:S15)),\"\")","v":""},null,null,null,null,16,"",{"$f":"IFERROR(INDEX(INDEX(Pro_2,MATCH($D$3,Pro_2,0)-1):INDEX(Pro_2,MATCH(2,1/(Pro_2=$D$3),1)),ROWS(Z$2:Z15)),\"\")","v":100},{"$f":"IFERROR(INDEX(INDEX(OFFSET(Pro_2,0,1),MATCH($D$3,Pro_2,0)-1):INDEX(OFFSET(Pro_2,0,1),MATCH(2,1/(Pro_2=$D$3),1)),ROWS(AA$2:AA15)),\"\")","v":1400},{"$f":"IFERROR(INDEX(INDEX(OFFSET(Pro_2,0,2),MATCH($D$3,Pro_2,0)-1):INDEX(OFFSET(Pro_2,0,2),MATCH(2,1/(Pro_2=$D$3),1)),ROWS(AB$2:AB15)),\"\")","v":2142},{"$f":"IFERROR(INDEX(INDEX(OFFSET(Pro_2,0,3),MATCH($D$3,Pro_2,0)-1):INDEX(OFFSET(Pro_2,0,3),MATCH(2,1/(Pro_2=$D$3),1)),ROWS(AC$2:AC15)),\"\")","v":445.8450046685341},null,null,null,"",16,{"$f":"IFERROR(INDEX(INDEX(Pro_3,MATCH($F$3,Pro_3,0)-1):INDEX(Pro_3,MATCH(2,1/(Pro_3=$F$3),1)),ROWS(AI$2:AI15)),\"\")","v":"Power (kW)"},{"$f":"IFERROR(INDEX(INDEX(OFFSET(Pro_3,0,1),MATCH($F$3,Pro_3,0)-1):INDEX(OFFSET(Pro_3,0,1),MATCH(2,1/(Pro_3=$F$3),1)),ROWS(AJ$2:AJ15)),\"\")","v":"Engine HS"},{"$f":"IFERROR(INDEX(INDEX(OFFSET(Pro_3,0,2),MATCH($F$3,Pro_3,0)-1):INDEX(OFFSET(Pro_3,0,2),MATCH(2,1/(Pro_3=$F$3),1)),ROWS(AK$2:AK15)),\"\")","v":"Power take-off (rpm)"},{"$f":"IFERROR(INDEX(INDEX(OFFSET(Pro_3,0,3),MATCH($F$3,Pro_3,0)-1):INDEX(OFFSET(Pro_3,0,3),MATCH(2,1/(Pro_3=$F$3),1)),ROWS(AL$2:AL15)),\"\")","v":"(Nm)"}]
[null,null,null,null,null,null,null,null,null,null,null,null,null,"","",{"$f":"IFERROR(INDEX(INDEX(Pro_1,MATCH($B$3,Pro_1,0)-1):INDEX(Pro_1,MATCH(2,1/(Pro_1=$B$3),1)),ROWS(P$2:P16)),\"\")","v":""},{"$f":"IFERROR(INDEX(INDEX(OFFSET(Pro_1,0,1),MATCH($B$3,Pro_1,0)-1):INDEX(OFFSET(Pro_1,0,1),MATCH(2,1/(Pro_1=$B$3),1)),ROWS(Q$2:Q16)),\"\")","v":""},{"$f":"IFERROR(INDEX(INDEX(OFFSET(Pro_1,0,2),MATCH($B$3,Pro_1,0)-1):INDEX(OFFSET(Pro_1,0,2),MATCH(2,1/(Pro_1=$B$3),1)),ROWS(R$2:R16)),\"\")","v":""},{"$f":"IFERROR(INDEX(INDEX(OFFSET(Pro_1,0,3),MATCH($B$3,Pro_1,0)-1):INDEX(OFFSET(Pro_1,0,3),MATCH(2,1/(Pro_1=$B$3),1)),ROWS(S$2:S16)),\"\")","v":""},null,null,null,null,17,"",{"$f":"IFERROR(INDEX(INDEX(Pro_2,MATCH($D$3,Pro_2,0)-1):INDEX(Pro_2,MATCH(2,1/(Pro_2=$D$3),1)),ROWS(Z$2:Z16)),\"\")","v":100},{"$f":"IFERROR(INDEX(INDEX(OFFSET(Pro_2,0,1),MATCH($D$3,Pro_2,0)-1):INDEX(OFFSET(Pro_2,0,1),MATCH(2,1/(Pro_2=$D$3),1)),ROWS(AA$2:AA16)),\"\")","v":1500},{"$f":"IFERROR(INDEX(INDEX(OFFSET(Pro_2,0,2),MATCH($D$3,Pro_2,0)-1):INDEX(OFFSET(Pro_2,0,2),MATCH(2,1/(Pro_2=$D$3),1)),ROWS(AB$2:AB16)),\"\")","v":2295},{"$f":"IFERROR(INDEX(INDEX(OFFSET(Pro_2,0,3),MATCH($D$3,Pro_2,0)-1):INDEX(OFFSET(Pro_2,0,3),MATCH(2,1/(Pro_2=$D$3),1)),ROWS(AC$2:AC16)),\"\")","v":416.12200435729847},null,null,null,17,"",{"$f":"IFERROR(INDEX(INDEX(Pro_3,MATCH($F$3,Pro_3,0)-1):INDEX(Pro_3,MATCH(2,1/(Pro_3=$F$3),1)),ROWS(AI$2:AI16)),\"\")","v":170},{"$f":"IFERROR(INDEX(INDEX(OFFSET(Pro_3,0,1),MATCH($F$3,Pro_3,0)-1):INDEX(OFFSET(Pro_3,0,1),MATCH(2,1/(Pro_3=$F$3),1)),ROWS(AJ$2:AJ16)),\"\")","v":800},{"$f":"IFERROR(INDEX(INDEX(OFFSET(Pro_3,0,2),MATCH($F$3,Pro_3,0)-1):INDEX(OFFSET(Pro_3,0,2),MATCH(2,1/(Pro_3=$F$3),1)),ROWS(AK$2:AK16)),\"\")","v":800},{"$f":"IFERROR(INDEX(INDEX(OFFSET(Pro_3,0,3),MATCH($F$3,Pro_3,0)-1):INDEX(OFFSET(Pro_3,0,3),MATCH(2,1/(Pro_3=$F$3),1)),ROWS(AL$2:AL16)),\"\")","v":2029.375}]
[null,null,null,null,null,null,null,null,null,null,null,null,null,"","",{"$f":"IFERROR(INDEX(INDEX(Pro_1,MATCH($B$3,Pro_1,0)-1):INDEX(Pro_1,MATCH(2,1/(Pro_1=$B$3),1)),ROWS(P$2:P17)),\"\")","v":""},{"$f":"IFERROR(INDEX(INDEX(OFFSET(Pro_1,0,1),MATCH($B$3,Pro_1,0)-1):INDEX(OFFSET(Pro_1,0,1),MATCH(2,1/(Pro_1=$B$3),1)),ROWS(Q$2:Q17)),\"\")","v":""},{"$f":"IFERROR(INDEX(INDEX(OFFSET(Pro_1,0,2),MATCH($B$3,Pro_1,0)-1):INDEX(OFFSET(Pro_1,0,2),MATCH(2,1/(Pro_1=$B$3),1)),ROWS(R$2:R17)),\"\")","v":""},{"$f":"IFERROR(INDEX(INDEX(OFFSET(Pro_1,0,3),MATCH($B$3,Pro_1,0)-1):INDEX(OFFSET(Pro_1,0,3),MATCH(2,1/(Pro_1=$B$3),1)),ROWS(S$2:S17)),\"\")","v":""},null,null,null,null,18,"",{"$f":"IFERROR(INDEX(INDEX(Pro_2,MATCH($D$3,Pro_2,0)-1):INDEX(Pro_2,MATCH(2,1/(Pro_2=$D$3),1)),ROWS(Z$2:Z17)),\"\")","v":100},{"$f":"IFERROR(INDEX(INDEX(OFFSET(Pro_2,0,1),MATCH($D$3,Pro_2,0)-1):INDEX(OFFSET(Pro_2,0,1),MATCH(2,1/(Pro_2=$D$3),1)),ROWS(AA$2:AA17)),\"\")","v":1600},{"$f":"IFERROR(INDEX(INDEX(OFFSET(Pro_2,0,2),MATCH($D$3,Pro_2,0)-1):INDEX(OFFSET(Pro_2,0,2),MATCH(2,1/(Pro_2=$D$3),1)),ROWS(AB$2:AB17)),\"\")","v":2448},{"$f":"IFERROR(INDEX(INDEX(OFFSET(Pro_2,0,3),MATCH($D$3,Pro_2,0)-1):INDEX(OFFSET(Pro_2,0,3),MATCH(2,1/(Pro_2=$D$3),1)),ROWS(AC$2:AC17)),\"\")","v":390.11437908496731},null,null,null,18,"",{"$f":"IFERROR(INDEX(INDEX(Pro_3,MATCH($F$3,Pro_3,0)-1):INDEX(Pro_3,MATCH(2,1/(Pro_3=$F$3),1)),ROWS(AI$2:AI17)),\"\")","v":170},{"$f":"IFERROR(INDEX(INDEX(OFFSET(Pro_3,0,1),MATCH($F$3,Pro_3,0)-1):INDEX(OFFSET(Pro_3,0,1),MATCH(2,1/(Pro_3=$F$3),1)),ROWS(AJ$2:AJ17)),\"\")","v":900},{"$f":"IFERROR(INDEX(INDEX(OFFSET(Pro_3,0,2),MATCH($F$3,Pro_3,0)-1):INDEX(OFFSET(Pro_3,0,2),MATCH(2,1/(Pro_3=$F$3),1)),ROWS(AK$2:AK17)),\"\")","v":900},{"$f":"IFERROR(INDEX(INDEX(OFFSET(Pro_3,0,3),MATCH($F$3,Pro_3,0)-1):INDEX(OFFSET(Pro_3,0,3),MATCH(2,1/(Pro_3=$F$3),1)),ROWS(AL$2:AL17)),\"\")","v":1803.8888888888889}]
[null,null,null,null,"EG15R DCxx",null,null,null,null,null,null,null,null,"","",{"$f":"IFERROR(INDEX(INDEX(Pro_1,MATCH($B$3,Pro_1,0)-1):INDEX(Pro_1,MATCH(2,1/(Pro_1=$B$3),1)),ROWS(P$2:P18)),\"\")","v":""},{"$f":"IFERROR(INDEX(INDEX(OFFSET(Pro_1,0,1),MATCH($B$3,Pro_1,0)-1):INDEX(OFFSET(Pro_1,0,1),MATCH(2,1/(Pro_1=$B$3),1)),ROWS(Q$2:Q18)),\"\")","v":""},{"$f":"IFERROR(INDEX(INDEX(OFFSET(Pro_1,0,2),MATCH($B$3,Pro_1,0)-1):INDEX(OFFSET(Pro_1,0,2),MATCH(2,1/(Pro_1=$B$3),1)),ROWS(R$2:R18)),\"\")","v":""},{"$f":"IFERROR(INDEX(INDEX(OFFSET(Pro_1,0,3),MATCH($B$3,Pro_1,0)-1):INDEX(OFFSET(Pro_1,0,3),MATCH(2,1/(Pro_1=$B$3),1)),ROWS(S$2:S18)),\"\")","v":""},null,null,null,null,19,"",{"$f":"IFERROR(INDEX(INDEX(Pro_2,MATCH($D$3,Pro_2,0)-1):INDEX(Pro_2,MATCH(2,1/(Pro_2=$D$3),1)),ROWS(Z$2:Z18)),\"\")","v":100},{"$f":"IFERROR(INDEX(INDEX(OFFSET(Pro_2,0,1),MATCH($D$3,Pro_2,0)-1):INDEX(OFFSET(Pro_2,0,1),MATCH(2,1/(Pro_2=$D$3),1)),ROWS(AA$2:AA18)),\"\")","v":1700},{"$f":"IFERROR(INDEX(INDEX(OFFSET(Pro_2,0,2),MATCH($D$3,Pro_2,0)-1):INDEX(OFFSET(Pro_2,0,2),MATCH(2,1/(Pro_2=$D$3),1)),ROWS(AB$2:AB18)),\"\")","v":2601},{"$f":"IFERROR(INDEX(INDEX(OFFSET(Pro_2,0,3),MATCH($D$3,Pro_2,0)-1):INDEX(OFFSET(Pro_2,0,3),MATCH(2,1/(Pro_2=$D$3),1)),ROWS(AC$2:AC18)),\"\")","v":367.16647443291043},null,null,null,19,"",{"$f":"IFERROR(INDEX(INDEX(Pro_3,MATCH($F$3,Pro_3,0)-1):INDEX(Pro_3,MATCH(2,1/(Pro_3=$F$3),1)),ROWS(AI$2:AI18)),\"\")","v":170},{"$f":"IFERROR(INDEX(INDEX(OFFSET(Pro_3,0,1),MATCH($F$3,Pro_3,0)-1):INDEX(OFFSET(Pro_3,0,1),MATCH(2,1/(Pro_3=$F$3),1)),ROWS(AJ$2:AJ18)),\"\")","v":1000},{"$f":"IFERROR(INDEX(INDEX(OFFSET(Pro_3,0,2),MATCH($F$3,Pro_3,0)-1):INDEX(OFFSET(Pro_3,0,2),MATCH(2,1/(Pro_3=$F$3),1)),ROWS(AK$2:AK18)),\"\")","v":1000},{"$f":"IFERROR(INDEX(INDEX(OFFSET(Pro_3,0,3),MATCH($F$3,Pro_3,0)-1):INDEX(OFFSET(Pro_3,0,3),MATCH(2,1/(Pro_3=$F$3),1)),ROWS(AL$2:AL18)),\"\")","v":1623.5}]
[null,null,null,null,null,null,null,null,null,null,null,null,null,"","",{"$f":"IFERROR(INDEX(INDEX(Pro_1,MATCH($B$3,Pro_1,0)-1):INDEX(Pro_1,MATCH(2,1/(Pro_1=$B$3),1)),ROWS(P$2:P19)),\"\")","v":""},{"$f":"IFERROR(INDEX(INDEX(OFFSET(Pro_1,0,1),MATCH($B$3,Pro_1,0)-1):INDEX(OFFSET(Pro_1,0,1),MATCH(2,1/(Pro_1=$B$3),1)),ROWS(Q$2:Q19)),\"\")","v":""},{"$f":"IFERROR(INDEX(INDEX(OFFSET(Pro_1,0,2),MATCH($B$3,Pro_1,0)-1):INDEX(OFFSET(Pro_1,0,2),MATCH(2,1/(Pro_1=$B$3),1)),ROWS(R$2:R19)),\"\")","v":""},{"$f":"IFERROR(INDEX(INDEX(OFFSET(Pro_1,0,3),MATCH($B$3,Pro_1,0)-1):INDEX(OFFSET(Pro_1,0,3),MATCH(2,1/(Pro_1=$B$3),1)),ROWS(S$2:S19)),\"\")","v":""},null,null,null,null,20,"",{"$f":"IFERROR(INDEX(INDEX(Pro_2,MATCH($D$3,Pro_2,0)-1):INDEX(Pro_2,MATCH(2,1/(Pro_2=$D$3),1)),ROWS(Z$2:Z19)),\"\")","v":100},{"$f":"IFERROR(INDEX(INDEX(OFFSET(Pro_2,0,1),MATCH($D$3,Pro_2,0)-1):INDEX(OFFSET(Pro_2,0,1),MATCH(2,1/(Pro_2=$D$3),1)),ROWS(AA$2:AA19)),\"\")","v":1800},{"$f":"IFERROR(INDEX(INDEX(OFFSET(Pro_2,0,2),MATCH($D$3,Pro_2,0)-1):INDEX(OFFSET(Pro_2,0,2),MATCH(2,1/(Pro_2=$D$3),1)),ROWS(AB$2:AB19)),\"\")","v":2754},{"$f":"IFERROR(INDEX(INDEX(OFFSET(Pro_2,0,3),MATCH($D$3,Pro_2,0)-1):INDEX(OFFSET(Pro_2,0,3),MATCH(2,1/(Pro_2=$D$3),1)),ROWS(AC$2:AC19)),\"\")","v":346.76833696441537},null,null,null,20,"",{"$f":"IFERROR(INDEX(INDEX(Pro_3,MATCH($F$3,Pro_3,0)-1):INDEX(Pro_3,MATCH(2,1/(Pro_3=$F$3),1)),ROWS(AI$2:AI19)),\"\")","v":170},{"$f":"IFERROR(INDEX(INDEX(OFFSET(Pro_3,0,1),MATCH($F$3,Pro_3,0)-1):INDEX(OFFSET(Pro_3,0,1),MATCH(2,1/(Pro_3=$F$3),1)),ROWS(AJ$2:AJ19)),\"\")","v":1100},{"$f":"IFERROR(INDEX(INDEX(OFFSET(Pro_3,0,2),MATCH($F$3,Pro_3,0)-1):INDEX(OFFSET(Pro_3,0,2),MATCH(2,1/(Pro_3=$F$3),1)),ROWS(AK$2:AK19)),\"\")","v":1100},{"$f":"IFERROR(INDEX(INDEX(OFFSET(Pro_3,0,3),MATCH($F$3,Pro_3,0)-1):INDEX(OFFSET(Pro_3,0,3),MATCH(2,1/(Pro_3=$F$3),1)),ROWS(AL$2:AL19)),\"\")","v":1475.909090909091}]
[null,null,null,null,null,null,null,null,null,null,null,null,null,"","",{"$f":"IFERROR(INDEX(INDEX(Pro_1,MATCH($B$3,Pro_1,0)-1):INDEX(Pro_1,MATCH(2,1/(Pro_1=$B$3),1)),ROWS(P$2:P20)),\"\")","v":""},{"$f":"IFERROR(INDEX(INDEX(OFFSET(Pro_1,0,1),MATCH($B$3,Pro_1,0)-1):INDEX(OFFSET(Pro_1,0,1),MATCH(2,1/(Pro_1=$B$3),1)),ROWS(Q$2:Q20)),\"\")","v":""},{"$f":"IFERROR(INDEX(INDEX(OFFSET(Pro_1,0,2),MATCH($B$3,Pro_1,0)-1):INDEX(OFFSET(Pro_1,0,2),MATCH(2,1/(Pro_1=$B$3),1)),ROWS(R$2:R20)),\"\")","v":""},{"$f":"IFERROR(INDEX(INDEX(OFFSET(Pro_1,0,3),MATCH($B$3,Pro_1,0)-1):INDEX(OFFSET(Pro_1,0,3),MATCH(2,1/(Pro_1=$B$3),1)),ROWS(S$2:S20)),\"\")","v":""},null,null,null,null,21,"",{"$f":"IFERROR(INDEX(INDEX(Pro_2,MATCH($D$3,Pro_2,0)-1):INDEX(Pro_2,MATCH(2,1/(Pro_2=$D$3),1)),ROWS(Z$2:Z20)),\"\")","v":100},{"$f":"IFERROR(INDEX(INDEX(OFFSET(Pro_2,0,1),MATCH($D$3,Pro_2,0)-1):INDEX(OFFSET(Pro_2,0,1),MATCH(2,1/(Pro_2=$D$3),1)),ROWS(AA$2:AA20)),\"\")","v":1900},{"$f":"IFERROR(INDEX(INDEX(OFFSET(Pro_2,0,2),MATCH($D$3,Pro_2,0)-1):INDEX(OFFSET(Pro_2,0,2),MATCH(2,1/(Pro_2=$D$3),1)),ROWS(AB$2:AB20)),\"\")","v":2907},{"$f":"IFERROR(INDEX(INDEX(OFFSET(Pro_2,0,3),MATCH($D$3,Pro_2,0)-1):INDEX(OFFSET(Pro_2,0,3),MATCH(2,1/(Pro_2=$D$3),1)),ROWS(AC$2:AC20)),\"\")","v":328.51737186102514},null,null,null,21,"",{"$f":"IFERROR(INDEX(INDEX(Pro_3,MATCH($F$3,Pro_3,0)-1):INDEX(Pro_3,MATCH(2,1/(Pro_3=$F$3),1)),ROWS(AI$2:AI20)),\"\")","v":170},{"$f":"IFERROR(INDEX(INDEX(OFFSET(Pro_3,0,1),MATCH($F$3,Pro_3,0)-1):INDEX(OFFSET(Pro_3,0,1),MATCH(2,1/(Pro_3=$F$3),1)),ROWS(AJ$2:AJ20)),\"\")","v":1200},{"$f":"IFERROR(INDEX(INDEX(OFFSET(Pro_3,0,2),MATCH($F$3,Pro_3,0)-1):INDEX(OFFSET(Pro_3,0,2),MATCH(2,1/(Pro_3=$F$3),1)),ROWS(AK$2:AK20)),\"\")","v":1200},{"$f":"IFERROR(INDEX(INDEX(OFFSET(Pro_3,0,3),MATCH($F$3,Pro_3,0)-1):INDEX(OFFSET(Pro_3,0,3),MATCH(2,1/(Pro_3=$F$3),1)),ROWS(AL$2:AL20)),\"\")","v":1352.9166666666667}]
[null,null,null,null,null,null,null,null,null,null,null,null,null,"","",{"$f":"IFERROR(INDEX(INDEX(Pro_1,MATCH($B$3,Pro_1,0)-1):INDEX(Pro_1,MATCH(2,1/(Pro_1=$B$3),1)),ROWS(P$2:P21)),\"\")","v":""},{"$f":"IFERROR(INDEX(INDEX(OFFSET(Pro_1,0,1),MATCH($B$3,Pro_1,0)-1):INDEX(OFFSET(Pro_1,0,1),MATCH(2,1/(Pro_1=$B$3),1)),ROWS(Q$2:Q21)),\"\")","v":""},{"$f":"IFERROR(INDEX(INDEX(OFFSET(Pro_1,0,2),MATCH($B$3,Pro_1,0)-1):INDEX(OFFSET(Pro_1,0,2),MATCH(2,1/(Pro_1=$B$3),1)),ROWS(R$2:R21)),\"\")","v":""},{"$f":"IFERROR(INDEX(INDEX(OFFSET(Pro_1,0,3),MATCH($B$3,Pro_1,0)-1):INDEX(OFFSET(Pro_1,0,3),MATCH(2,1/(Pro_1=$B$3),1)),ROWS(S$2:S21)),\"\")","v":""},null,null,null,null,"","",{"$f":"IFERROR(INDEX(INDEX(Pro_2,MATCH($D$3,Pro_2,0)-1):INDEX(Pro_2,MATCH(2,1/(Pro_2=$D$3),1)),ROWS(Z$2:Z21)),\"\")","v":""},{"$f":"IFERROR(INDEX(INDEX(OFFSET(Pro_2,0,1),MATCH($D$3,Pro_2,0)-1):INDEX(OFFSET(Pro_2,0,1),MATCH(2,1/(Pro_2=$D$3),1)),ROWS(AA$2:AA21)),\"\")","v":""},{"$f":"IFERROR(INDEX(INDEX(OFFSET(Pro_2,0,2),MATCH($D$3,Pro_2,0)-1):INDEX(OFFSET(Pro_2,0,2),MATCH(2,1/(Pro_2=$D$3),1)),ROWS(AB$2:AB21)),\"\")","v":""},{"$f":"IFERROR(INDEX(INDEX(OFFSET(Pro_2,0,3),MATCH($D$3,Pro_2,0)-1):INDEX(OFFSET(Pro_2,0,3),MATCH(2,1/(Pro_2=$D$3),1)),ROWS(AC$2:AC21)),\"\")","v":""},null,null,null,22,"",{"$f":"IFERROR(INDEX(INDEX(Pro_3,MATCH($F$3,Pro_3,0)-1):INDEX(Pro_3,MATCH(2,1/(Pro_3=$F$3),1)),ROWS(AI$2:AI21)),\"\")","v":170},{"$f":"IFERROR(INDEX(INDEX(OFFSET(Pro_3,0,1),MATCH($F$3,Pro_3,0)-1):INDEX(OFFSET(Pro_3,0,1),MATCH(2,1/(Pro_3=$F$3),1)),ROWS(AJ$2:AJ21)),\"\")","v":1300},{"$f":"IFERROR(INDEX(INDEX(OFFSET(Pro_3,0,2),MATCH($F$3,Pro_3,0)-1):INDEX(OFFSET(Pro_3,0,2),MATCH(2,1/(Pro_3=$F$3),1)),ROWS(AK$2:AK21)),\"\")","v":1300},{"$f":"IFERROR(INDEX(INDEX(OFFSET(Pro_3,0,3),MATCH($F$3,Pro_3,0)-1):INDEX(OFFSET(Pro_3,0,3),MATCH(2,1/(Pro_3=$F$3),1)),ROWS(AL$2:AL21)),\"\")","v":1248.8461538461538}]
[{"$f":"IF(F2=E19, A24,A22)","v":0},null,null,null,null,null,null,null,null,null,null,null,null,"","",{"$f":"IFERROR(INDEX(INDEX(Pro_1,MATCH($B$3,Pro_1,0)-1):INDEX(Pro_1,MATCH(2,1/(Pro_1=$B$3),1)),ROWS(P$2:P22)),\"\")","v":""},{"$f":"IFERROR(INDEX(INDEX(OFFSET(Pro_1,0,1),MATCH($B$3,Pro_1,0)-1):INDEX(OFFSET(Pro_1,0,1),MATCH(2,1/(Pro_1=$B$3),1)),ROWS(Q$2:Q22)),\"\")","v":""},{"$f":"IFERROR(INDEX(INDEX(OFFSET(Pro_1,0,2),MATCH($B$3,Pro_1,0)-1):INDEX(OFFSET(Pro_1,0,2),MATCH(2,1/(Pro_1=$B$3),1)),ROWS(R$2:R22)),\"\")","v":""},{"$f":"IFERROR(INDEX(INDEX(OFFSET(Pro_1,0,3),MATCH($B$3,Pro_1,0)-1):INDEX(OFFSET(Pro_1,0,3),MATCH(2,1/(Pro_1=$B$3),1)),ROWS(S$2:S22)),\"\")","v":""},null,null,null,null,"","",{"$f":"IFERROR(INDEX(INDEX(Pro_2,MATCH($D$3,Pro_2,0)-1):INDEX(Pro_2,MATCH(2,1/(Pro_2=$D$3),1)),ROWS(Z$2:Z22)),\"\")","v":""},{"$f":"IFERROR(INDEX(INDEX(OFFSET(Pro_2,0,1),MATCH($D$3,Pro_2,0)-1):INDEX(OFFSET(Pro_2,0,1),MATCH(2,1/(Pro_2=$D$3),1)),ROWS(AA$2:AA22)),\"\")","v":""},{"$f":"IFERROR(INDEX(INDEX(OFFSET(Pro_2,0,2),MATCH($D$3,Pro_2,0)-1):INDEX(OFFSET(Pro_2,0,2),MATCH(2,1/(Pro_2=$D$3),1)),ROWS(AB$2:AB22)),\"\")","v":""},{"$f":"IFERROR(INDEX(INDEX(OFFSET(Pro_2,0,3),MATCH($D$3,Pro_2,0)-1):INDEX(OFFSET(Pro_2,0,3),MATCH(2,1/(Pro_2=$D$3),1)),ROWS(AC$2:AC22)),\"\")","v":""},null,null,null,23,"",{"$f":"IFERROR(INDEX(INDEX(Pro_3,MATCH($F$3,Pro_3,0)-1):INDEX(Pro_3,MATCH(2,1/(Pro_3=$F$3),1)),ROWS(AI$2:AI22)),\"\")","v":170},{"$f":"IFERROR(INDEX(INDEX(OFFSET(Pro_3,0,1),MATCH($F$3,Pro_3,0)-1):INDEX(OFFSET(Pro_3,0,1),MATCH(2,1/(Pro_3=$F$3),1)),ROWS(AJ$2:AJ22)),\"\")","v":1400},{"$f":"IFERROR(INDEX(INDEX(OFFSET(Pro_3,0,2),MATCH($F$3,Pro_3,0)-1):INDEX(OFFSET(Pro_3,0,2),MATCH(2,1/(Pro_3=$F$3),1)),ROWS(AK$2:AK22)),\"\")","v":1400},{"$f":"IFERROR(INDEX(INDEX(OFFSET(Pro_3,0,3),MATCH($F$3,Pro_3,0)-1):INDEX(OFFSET(Pro_3,0,3),MATCH(2,1/(Pro_3=$F$3),1)),ROWS(AL$2:AL22)),\"\")","v":1159.6428571428571}]
["For power take-off EG15R DCxx,  HS means engine speed in gear 3, 6 and LS means engine speed in gear R, N, 1, 2, 4 and 5",null,null,null,null,null,null,null,null,"",null,null,null,"","",{"$f":"IFERROR(INDEX(INDEX(Pro_1,MATCH($B$3,Pro_1,0)-1):INDEX(Pro_1,MATCH(2,1/(Pro_1=$B$3),1)),ROWS(P$2:P23)),\"\")","v":""},{"$f":"IFERROR(INDEX(INDEX(OFFSET(Pro_1,0,1),MATCH($B$3,Pro_1,0)-1):INDEX(OFFSET(Pro_1,0,1),MATCH(2,1/(Pro_1=$B$3),1)),ROWS(Q$2:Q23)),\"\")","v":""},{"$f":"IFERROR(INDEX(INDEX(OFFSET(Pro_1,0,2),MATCH($B$3,Pro_1,0)-1):INDEX(OFFSET(Pro_1,0,2),MATCH(2,1/(Pro_1=$B$3),1)),ROWS(R$2:R23)),\"\")","v":""},{"$f":"IFERROR(INDEX(INDEX(OFFSET(Pro_1,0,3),MATCH($B$3,Pro_1,0)-1):INDEX(OFFSET(Pro_1,0,3),MATCH(2,1/(Pro_1=$B$3),1)),ROWS(S$2:S23)),\"\")","v":""},null,null,null,null,"","",{"$f":"IFERROR(INDEX(INDEX(Pro_2,MATCH($D$3,Pro_2,0)-1):INDEX(Pro_2,MATCH(2,1/(Pro_2=$D$3),1)),ROWS(Z$2:Z23)),\"\")","v":""},{"$f":"IFERROR(INDEX(INDEX(OFFSET(Pro_2,0,1),MATCH($D$3,Pro_2,0)-1):INDEX(OFFSET(Pro_2,0,1),MATCH(2,1/(Pro_2=$D$3),1)),ROWS(AA$2:AA23)),\"\")","v":""},{"$f":"IFERROR(INDEX(INDEX(OFFSET(Pro_2,0,2),MATCH($D$3,Pro_2,0)-1):INDEX(OFFSET(Pro_2,0,2),MATCH(2,1/(Pro_2=$D$3),1)),ROWS(AB$2:AB23)),\"\")","v":""},{"$f":"IFERROR(INDEX(INDEX(OFFSET(Pro_2,0,3),MATCH($D$3,Pro_2,0)-1):INDEX(OFFSET(Pro_2,0,3),MATCH(2,1/(Pro_2=$D$3),1)),ROWS(AC$2:AC23)),\"\")","v":""},null,null,null,24,"",{"$f":"IFERROR(INDEX(INDEX(Pro_3,MATCH($F$3,Pro_3,0)-1):INDEX(Pro_3,MATCH(2,1/(Pro_3=$F$3),1)),ROWS(AI$2:AI23)),\"\")","v":170},{"$f":"IFERROR(INDEX(INDEX(OFFSET(Pro_3,0,1),MATCH($F$3,Pro_3,0)-1):INDEX(OFFSET(Pro_3,0,1),MATCH(2,1/(Pro_3=$F$3),1)),ROWS(AJ$2:AJ23)),\"\")","v":1500},{"$f":"IFERROR(INDEX(INDEX(OFFSET(Pro_3,0,2),MATCH($F$3,Pro_3,0)-1):INDEX(OFFSET(Pro_3,0,2),MATCH(2,1/(Pro_3=$F$3),1)),ROWS(AK$2:AK23)),\"\")","v":1500},{"$f":"IFERROR(INDEX(INDEX(OFFSET(Pro_3,0,3),MATCH($F$3,Pro_3,0)-1):INDEX(OFFSET(Pro_3,0,3),MATCH(2,1/(Pro_3=$F$3),1)),ROWS(AL$2:AL23)),\"\")","v":1082.3333333333333}]
[null,null,null,null,null,null,null,null,null,"",null,null,null,"","",{"$f":"IFERROR(INDEX(INDEX(Pro_1,MATCH($B$3,Pro_1,0)-1):INDEX(Pro_1,MATCH(2,1/(Pro_1=$B$3),1)),ROWS(P$2:P24)),\"\")","v":""},{"$f":"IFERROR(INDEX(INDEX(OFFSET(Pro_1,0,1),MATCH($B$3,Pro_1,0)-1):INDEX(OFFSET(Pro_1,0,1),MATCH(2,1/(Pro_1=$B$3),1)),ROWS(Q$2:Q24)),\"\")","v":""},{"$f":"IFERROR(INDEX(INDEX(OFFSET(Pro_1,0,2),MATCH($B$3,Pro_1,0)-1):INDEX(OFFSET(Pro_1,0,2),MATCH(2,1/(Pro_1=$B$3),1)),ROWS(R$2:R24)),\"\")","v":""},{"$f":"IFERROR(INDEX(INDEX(OFFSET(Pro_1,0,3),MATCH($B$3,Pro_1,0)-1):INDEX(OFFSET(Pro_1,0,3),MATCH(2,1/(Pro_1=$B$3),1)),ROWS(S$2:S24)),\"\")","v":""},null,null,null,null,"","",{"$f":"IFERROR(INDEX(INDEX(Pro_2,MATCH($D$3,Pro_2,0)-1):INDEX(Pro_2,MATCH(2,1/(Pro_2=$D$3),1)),ROWS(Z$2:Z24)),\"\")","v":""},{"$f":"IFERROR(INDEX(INDEX(OFFSET(Pro_2,0,1),MATCH($D$3,Pro_2,0)-1):INDEX(OFFSET(Pro_2,0,1),MATCH(2,1/(Pro_2=$D$3),1)),ROWS(AA$2:AA24)),\"\")","v":""},{"$f":"IFERROR(INDEX(INDEX(OFFSET(Pro_2,0,2),MATCH($D$3,Pro_2,0)-1):INDEX(OFFSET(Pro_2,0,2),MATCH(2,1/(Pro_2=$D$3),1)),ROWS(AB$2:AB24)),\"\")","v":""},{"$f":"IFERROR(INDEX(INDEX(OFFSET(Pro_2,0,3),MATCH($D$3,Pro_2,0)-1):INDEX(OFFSET(Pro_2,0,3),MATCH(2,1/(Pro_2=$D$3),1)),ROWS(AC$2:AC24)),\"\")","v":""},null,null,null,25,"",{"$f":"IFERROR(INDEX(INDEX(Pro_3,MATCH($F$3,Pro_3,0)-1):INDEX(Pro_3,MATCH(2,1/(Pro_3=$F$3),1)),ROWS(AI$2:AI24)),\"\")","v":170},{"$f":"IFERROR(INDEX(INDEX(OFFSET(Pro_3,0,1),MATCH($F$3,Pro_3,0)-1):INDEX(OFFSET(Pro_3,0,1),MATCH(2,1/(Pro_3=$F$3),1)),ROWS(AJ$2:AJ24)),\"\")","v":1600},{"$f":"IFERROR(INDEX(INDEX(OFFSET(Pro_3,0,2),MATCH($F$3,Pro_3,0)-1):INDEX(OFFSET(Pro_3,0,2),MATCH(2,1/(Pro_3=$F$3),1)),ROWS(AK$2:AK24)),\"\")","v":1600},{"$f":"IFERROR(INDEX(INDEX(OFFSET(Pro_3,0,3),MATCH($F$3,Pro_3,0)-1):INDEX(OFFSET(Pro_3,0,3),MATCH(2,1/(Pro_3=$F$3),1)),ROWS(AL$2:AL24)),\"\")","v":1014.6875}]
[null,null,null,null,null,null,null,null,null,"",null,null,null,"","",{"$f":"IFERROR(INDEX(INDEX(Pro_1,MATCH($B$3,Pro_1,0)-1):INDEX(Pro_1,MATCH(2,1/(Pro_1=$B$3),1)),ROWS(P$2:P25)),\"\")","v":""},{"$f":"IFERROR(INDEX(INDEX(OFFSET(Pro_1,0,1),MATCH($B$3,Pro_1,0)-1):INDEX(OFFSET(Pro_1,0,1),MATCH(2,1/(Pro_1=$B$3),1)),ROWS(Q$2:Q25)),\"\")","v":""},{"$f":"IFERROR(INDEX(INDEX(OFFSET(Pro_1,0,2),MATCH($B$3,Pro_1,0)-1):INDEX(OFFSET(Pro_1,0,2),MATCH(2,1/(Pro_1=$B$3),1)),ROWS(R$2:R25)),\"\")","v":""},{"$f":"IFERROR(INDEX(INDEX(OFFSET(Pro_1,0,3),MATCH($B$3,Pro_1,0)-1):INDEX(OFFSET(Pro_1,0,3),MATCH(2,1/(Pro_1=$B$3),1)),ROWS(S$2:S25)),\"\")","v":""},null,null,null,null,"","",{"$f":"IFERROR(INDEX(INDEX(Pro_2,MATCH($D$3,Pro_2,0)-1):INDEX(Pro_2,MATCH(2,1/(Pro_2=$D$3),1)),ROWS(Z$2:Z25)),\"\")","v":""},{"$f":"IFERROR(INDEX(INDEX(OFFSET(Pro_2,0,1),MATCH($D$3,Pro_2,0)-1):INDEX(OFFSET(Pro_2,0,1),MATCH(2,1/(Pro_2=$D$3),1)),ROWS(AA$2:AA25)),\"\")","v":""},{"$f":"IFERROR(INDEX(INDEX(OFFSET(Pro_2,0,2),MATCH($D$3,Pro_2,0)-1):INDEX(OFFSET(Pro_2,0,2),MATCH(2,1/(Pro_2=$D$3),1)),ROWS(AB$2:AB25)),\"\")","v":""},{"$f":"IFERROR(INDEX(INDEX(OFFSET(Pro_2,0,3),MATCH($D$3,Pro_2,0)-1):INDEX(OFFSET(Pro_2,0,3),MATCH(2,1/(Pro_2=$D$3),1)),ROWS(AC$2:AC25)),\"\")","v":""},null,null,null,26,"",{"$f":"IFERROR(INDEX(INDEX(Pro_3,MATCH($F$3,Pro_3,0)-1):INDEX(Pro_3,MATCH(2,1/(Pro_3=$F$3),1)),ROWS(AI$2:AI25)),\"\")","v":170},{"$f":"IFERROR(INDEX(INDEX(OFFSET(Pro_3,0,1),MATCH($F$3,Pro_3,0)-1):INDEX(OFFSET(Pro_3,0,1),MATCH(2,1/(Pro_3=$F$3),1)),ROWS(AJ$2:AJ25)),\"\")","v":1700},{"$f":"IFERROR(INDEX(INDEX(OFFSET(Pro_3,0,2),MATCH($F$3,Pro_3,0)-1):INDEX(OFFSET(Pro_3,0,2),MATCH(2,1/(Pro_3=$F$3),1)),ROWS(AK$2:AK25)),\"\")","v":1700},{"$f":"IFERROR(INDEX(INDEX(OFFSET(Pro_3,0,3),MATCH($F$3,Pro_3,0)-1):INDEX(OFFSET(Pro_3,0,3),MATCH(2,1/(Pro_3=$F$3),1)),ROWS(AL$2:AL25)),\"\")","v":955}]
[null,null,null,null,null,null,null,null,null,"",null,null,null,"","",{"$f":"IFERROR(INDEX(INDEX(Pro_1,MATCH($B$3,Pro_1,0)-1):INDEX(Pro_1,MATCH(2,1/(Pro_1=$B$3),1)),ROWS(P$2:P26)),\"\")","v":""},{"$f":"IFERROR(INDEX(INDEX(OFFSET(Pro_1,0,1),MATCH($B$3,Pro_1,0)-1):INDEX(OFFSET(Pro_1,0,1),MATCH(2,1/(Pro_1=$B$3),1)),ROWS(Q$2:Q26)),\"\")","v":""},{"$f":"IFERROR(INDEX(INDEX(OFFSET(Pro_1,0,2),MATCH($B$3,Pro_1,0)-1):INDEX(OFFSET(Pro_1,0,2),MATCH(2,1/(Pro_1=$B$3),1)),ROWS(R$2:R26)),\"\")","v":""},{"$f":"IFERROR(INDEX(INDEX(OFFSET(Pro_1,0,3),MATCH($B$3,Pro_1,0)-1):INDEX(OFFSET(Pro_1,0,3),MATCH(2,1/(Pro_1=$B$3),1)),ROWS(S$2:S26)),\"\")","v":""},null,null,null,null,"","",{"$f":"IFERROR(INDEX(INDEX(Pro_2,MATCH($D$3,Pro_2,0)-1):INDEX(Pro_2,MATCH(2,1/(Pro_2=$D$3),1)),ROWS(Z$2:Z26)),\"\")","v":""},{"$f":"IFERROR(INDEX(INDEX(OFFSET(Pro_2,0,1),MATCH($D$3,Pro_2,0)-1):INDEX(OFFSET(Pro_2,0,1),MATCH(2,1/(Pro_2=$D$3),1)),ROWS(AA$2:AA26)),\"\")","v":""},{"$f":"IFERROR(INDEX(INDEX(OFFSET(Pro_2,0,2),MATCH($D$3,Pro_2,0)-1):INDEX(OFFSET(Pro_2,0,2),MATCH(2,1/(Pro_2=$D$3),1)),ROWS(AB$2:AB26)),\"\")","v":""},{"$f":"IFERROR(INDEX(INDEX(OFFSET(Pro_2,0,3),MATCH($D$3,Pro_2,0)-1):INDEX(OFFSET(Pro_2,0,3),MATCH(2,1/(Pro_2=$D$3),1)),ROWS(AC$2:AC26)),\"\")","v":""},null,null,null,27,"",{"$f":"IFERROR(INDEX(INDEX(Pro_3,MATCH($F$3,Pro_3,0)-1):INDEX(Pro_3,MATCH(2,1/(Pro_3=$F$3),1)),ROWS(AI$2:AI26)),\"\")","v":170},{"$f":"IFERROR(INDEX(INDEX(OFFSET(Pro_3,0,1),MATCH($F$3,Pro_3,0)-1):INDEX(OFFSET(Pro_3,0,1),MATCH(2,1/(Pro_3=$F$3),1)),ROWS(AJ$2:AJ26)),\"\")","v":1800},{"$f":"IFERROR(INDEX(INDEX(OFFSET(Pro_3,0,2),MATCH($F$3,Pro_3,0)-1):INDEX(OFFSET(Pro_3,0,2),MATCH(2,1/(Pro_3=$F$3),1)),ROWS(AK$2:AK26)),\"\")","v":1800},{"$f":"IFERROR(INDEX(INDEX(OFFSET(Pro_3,0,3),MATCH($F$3,Pro_3,0)-1):INDEX(OFFSET(Pro_3,0,3),MATCH(2,1/(Pro_3=$F$3),1)),ROWS(AL$2:AL26)),\"\")","v":901.94444444444446}]
["DATALABLE","X","Y","LABLE",null,null,null,null,null,"",null,null,null,"","",{"$f":"IFERROR(INDEX(INDEX(Pro_1,MATCH($B$3,Pro_1,0)-1):INDEX(Pro_1,MATCH(2,1/(Pro_1=$B$3),1)),ROWS(P$2:P27)),\"\")","v":""},{"$f":"IFERROR(INDEX(INDEX(OFFSET(Pro_1,0,1),MATCH($B$3,Pro_1,0)-1):INDEX(OFFSET(Pro_1,0,1),MATCH(2,1/(Pro_1=$B$3),1)),ROWS(Q$2:Q27)),\"\")","v":""},{"$f":"IFERROR(INDEX(INDEX(OFFSET(Pro_1,0,2),MATCH($B$3,Pro_1,0)-1):INDEX(OFFSET(Pro_1,0,2),MATCH(2,1/(Pro_1=$B$3),1)),ROWS(R$2:R27)),\"\")","v":""},{"$f":"IFERROR(INDEX(INDEX(OFFSET(Pro_1,0,3),MATCH($B$3,Pro_1,0)-1):INDEX(OFFSET(Pro_1,0,3),MATCH(2,1/(Pro_1=$B$3),1)),ROWS(S$2:S27)),\"\")","v":""},null,null,null,null,"","",{"$f":"IFERROR(INDEX(INDEX(Pro_2,MATCH($D$3,Pro_2,0)-1):INDEX(Pro_2,MATCH(2,1/(Pro_2=$D$3),1)),ROWS(Z$2:Z27)),\"\")","v":""},{"$f":"IFERROR(INDEX(INDEX(OFFSET(Pro_2,0,1),MATCH($D$3,Pro_2,0)-1):INDEX(OFFSET(Pro_2,0,1),MATCH(2,1/(Pro_2=$D$3),1)),ROWS(AA$2:AA27)),\"\")","v":""},{"$f":"IFERROR(INDEX(INDEX(OFFSET(Pro_2,0,2),MATCH($D$3,Pro_2,0)-1):INDEX(OFFSET(Pro_2,0,2),MATCH(2,1/(Pro_2=$D$3),1)),ROWS(AB$2:AB27)),\"\")","v":""},{"$f":"IFERROR(INDEX(INDEX(OFFSET(Pro_2,0,3),MATCH($D$3,Pro_2,0)-1):INDEX(OFFSET(Pro_2,0,3),MATCH(2,1/(Pro_2=$D$3),1)),ROWS(AC$2:AC27)),\"\")","v":""},null,null,null,28,"",{"$f":"IFERROR(INDEX(INDEX(Pro_3,MATCH($F$3,Pro_3,0)-1):INDEX(Pro_3,MATCH(2,1/(Pro_3=$F$3),1)),ROWS(AI$2:AI27)),\"\")","v":170},{"$f":"IFERROR(INDEX(INDEX(OFFSET(Pro_3,0,1),MATCH($F$3,Pro_3,0)-1):INDEX(OFFSET(Pro_3,0,1),MATCH(2,1/(Pro_3=$F$3),1)),ROWS(AJ$2:AJ27)),\"\")","v":1900},{"$f":"IFERROR(INDEX(INDEX(OFFSET(Pro_3,0,2),MATCH($F$3,Pro_3,0)-1):INDEX(OFFSET(Pro_3,0,2),MATCH(2,1/(Pro_3=$F$3),1)),ROWS(AK$2:AK27)),\"\")","v":1900},{"$f":"IFERROR(INDEX(INDEX(OFFSET(Pro_3,0,3),MATCH($F$3,Pro_3,0)-1):INDEX(OFFSET(Pro_3,0,3),MATCH(2,1/(Pro_3=$F$3),1)),ROWS(AL$2:AL27)),\"\")","v":854.47368421052636}]
["UHS1",{"$f":"IF(X_MAHS_1=0,\"\",X_MAHS_1)","v":""},{"$f":"IF(Max_HS_1=0,\"\",Max_HS_1)","v":""},{"$f":"IF(AND(B29=\"\",C29=\"\"),\"\",A29&\";\"&ROUND(B29,0)&\";\"&ROUND(C29,0))","v":""},null,null,null,null,null,"",null,null,null,"","",{"$f":"IFERROR(INDEX(INDEX(Pro_1,MATCH($B$3,Pro_1,0)-1):INDEX(Pro_1,MATCH(2,1/(Pro_1=$B$3),1)),ROWS(P$2:P28)),\"\")","v":""},{"$f":"IFERROR(INDEX(INDEX(OFFSET(Pro_1,0,1),MATCH($B$3,Pro_1,0)-1):INDEX(OFFSET(Pro_1,0,1),MATCH(2,1/(Pro_1=$B$3),1)),ROWS(Q$2:Q28)),\"\")","v":""},{"$f":"IFERROR(INDEX(INDEX(OFFSET(Pro_1,0,2),MATCH($B$3,Pro_1,0)-1):INDEX(OFFSET(Pro_1,0,2),MATCH(2,1/(Pro_1=$B$3),1)),ROWS(R$2:R28)),\"\")","v":""},{"$f":"IFERROR(INDEX(INDEX(OFFSET(Pro_1,0,3),MATCH($B$3,Pro_1,0)-1):INDEX(OFFSET(Pro_1,0,3),MATCH(2,1/(Pro_1=$B$3),1)),ROWS(S$2:S28)),\"\")","v":""},null,null,null,null,"","",{"$f":"IFERROR(INDEX(INDEX(Pro_2,MATCH($D$3,Pro_2,0)-1):INDEX(Pro_2,MATCH(2,1/(Pro_2=$D$3),1)),ROWS(Z$2:Z28)),\"\")","v":""},{"$f":"IFERROR(INDEX(INDEX(OFFSET(Pro_2,0,1),MATCH($D$3,Pro_2,0)-1):INDEX(OFFSET(Pro_2,0,1),MATCH(2,1/(Pro_2=$D$3),1)),ROWS(AA$2:AA28)),\"\")","v":""},{"$f":"IFERROR(INDEX(INDEX(OFFSET(Pro_2,0,2),MATCH($D$3,Pro_2,0)-1):INDEX(OFFSET(Pro_2,0,2),MATCH(2,1/(Pro_2=$D$3),1)),ROWS(AB$2:AB28)),\"\")","v":""},{"$f":"IFERROR(INDEX(INDEX(OFFSET(Pro_2,0,3),MATCH($D$3,Pro_2,0)-1):INDEX(OFFSET(Pro_2,0,3),MATCH(2,1/(Pro_2=$D$3),1)),ROWS(AC$2:AC28)),\"\")","v":""},null,null,null,"","",{"$f":"IFERROR(INDEX(INDEX(Pro_3,MATCH($F$3,Pro_3,0)-1):INDEX(Pro_3,MATCH(2,1/(Pro_3=$F$3),1)),ROWS(AI$2:AI28)),\"\")","v":""},{"$f":"IFERROR(INDEX(INDEX(OFFSET(Pro_3,0,1),MATCH($F$3,Pro_3,0)-1):INDEX(OFFSET(Pro_3,0,1),MATCH(2,1/(Pro_3=$F$3),1)),ROWS(AJ$2:AJ28)),\"\")","v":""},{"$f":"IFERROR(INDEX(INDEX(OFFSET(Pro_3,0,2),MATCH($F$3,Pro_3,0)-1):INDEX(OFFSET(Pro_3,0,2),MATCH(2,1/(Pro_3=$F$3),1)),ROWS(AK$2:AK28)),\"\")","v":""},{"$f":"IFERROR(INDEX(INDEX(OFFSET(Pro_3,0,3),MATCH($F$3,Pro_3,0)-1):INDEX(OFFSET(Pro_3,0,3),MATCH(2,1/(Pro_3=$F$3),1)),ROWS(AL$2:AL28)),\"\")","v":""}]
["LHS1",{"$f":"IF(X_MIHS_1=0,\"\",X_MIHS_1)","v":""},{"$f":"IF(Min_HS_1=0,\"\",Min_HS_1)","v":""},{"$f":"IF(AND(B30=\"\",C30=\"\"),\"\",A30&\";\"&ROUND(B30,0)&\";\"&ROUND(C30,0))","v":""},null,null,null,null,null,"",null,null,null,"","",{"$f":"IFERROR(INDEX(INDEX(Pro_1,MATCH($B$3,Pro_1,0)-1):INDEX(Pro_1,MATCH(2,1/(Pro_1=$B$3),1)),ROWS(P$2:P29)),\"\")","v":""},{"$f":"IFERROR(INDEX(INDEX(OFFSET(Pro_1,0,1),MATCH($B$3,Pro_1,0)-1):INDEX(OFFSET(Pro_1,0,1),MATCH(2,1/(Pro_1=$B$3),1)),ROWS(Q$2:Q29)),\"\")","v":""},{"$f":"IFERROR(INDEX(INDEX(OFFSET(Pro_1,0,2),MATCH($B$3,Pro_1,0)-1):INDEX(OFFSET(Pro_1,0,2),MATCH(2,1/(Pro_1=$B$3),1)),ROWS(R$2:R29)),\"\")","v":""},{"$f":"IFERROR(INDEX(INDEX(OFFSET(Pro_1,0,3),MATCH($B$3,Pro_1,0)-1):INDEX(OFFSET(Pro_1,0,3),MATCH(2,1/(Pro_1=$B$3),1)),ROWS(S$2:S29)),\"\")","v":""},null,null,null,null,"","",{"$f":"IFERROR(INDEX(INDEX(Pro_2,MATCH($D$3,Pro_2,0)-1):INDEX(Pro_2,MATCH(2,1/(Pro_2=$D$3),1)),ROWS(Z$2:Z29)),\"\")","v":""},{"$f":"IFERROR(INDEX(INDEX(OFFSET(Pro_2,0,1),MATCH($D$3,Pro_2,0)-1):INDEX(OFFSET(Pro_2,0,1),MATCH(2,1/(Pro_2=$D$3),1)),ROWS(AA$2:AA29)),\"\")","v":""},{"$f":"IFERROR(INDEX(INDEX(OFFSET(Pro_2,0,2),MATCH($D$3,Pro_2,0)-1):INDEX(OFFSET(Pro_2,0,2),MATCH(2,1/(Pro_2=$D$3),1)),ROWS(AB$2:AB29)),\"\")","v":""},{"$f":"IFERROR(INDEX(INDEX(OFFSET(Pro_2,0,3),MATCH($D$3,Pro_2,0)-1):INDEX(OFFSET(Pro_2,0,3),MATCH(2,1/(Pro_2=$D$3),1)),ROWS(AC$2:AC29)),\"\")","v":""},null,null,null,"","",{"$f":"IFERROR(INDEX(INDEX(Pro_3,MATCH($F$3,Pro_3,0)-1):INDEX(Pro_3,MATCH(2,1/(Pro_3=$F$3),1)),ROWS(AI$2:AI29)),\"\")","v":""},{"$f":"IFERROR(INDEX(INDEX(OFFSET(Pro_3,0,1),MATCH($F$3,Pro_3,0)-1):INDEX(OFFSET(Pro_3,0,1),MATCH(2,1/(Pro_3=$F$3),1)),ROWS(AJ$2:AJ29)),\"\")","v":""},{"$f":"IFERROR(INDEX(INDEX(OFFSET(Pro_3,0,2),MATCH($F$3,Pro_3,0)-1):INDEX(OFFSET(Pro_3,0,2),MATCH(2,1/(Pro_3=$F$3),1)),ROWS(AK$2:AK29)),\"\")","v":""},{"$f":"IFERROR(INDEX(INDEX(OFFSET(Pro_3,0,3),MATCH($F$3,Pro_3,0)-1):INDEX(OFFSET(Pro_3,0,3),MATCH(2,1/(Pro_3=$F$3),1)),ROWS(AL$2:AL29)),\"\")","v":""}]
["ULS1",{"$f":"IF(OR(X_MALS_1=0,COUNT(OFFSET(Powr_LS_range_1,0,3))=1),\"\",X_MALS_1)","v":996.88596491228066},{"$f":"IF(OR(Max_LS_1=0,B31=\"\"),\"\",Max_LS_1)","v":2280},{"$f":"IF(AND(B31=\"\",C31=\"\"),\"\",A31&\";\"&ROUND(B31,0)&\";\"&ROUND(C31,0))","v":"ULS1;997;2280"},null,null,null,null,null,"",null,null,null,"","",{"$f":"IFERROR(INDEX(INDEX(Pro_1,MATCH($B$3,Pro_1,0)-1):INDEX(Pro_1,MATCH(2,1/(Pro_1=$B$3),1)),ROWS(P$2:P30)),\"\")","v":""},{"$f":"IFERROR(INDEX(INDEX(OFFSET(Pro_1,0,1),MATCH($B$3,Pro_1,0)-1):INDEX(OFFSET(Pro_1,0,1),MATCH(2,1/(Pro_1=$B$3),1)),ROWS(Q$2:Q30)),\"\")","v":""},{"$f":"IFERROR(INDEX(INDEX(OFFSET(Pro_1,0,2),MATCH($B$3,Pro_1,0)-1):INDEX(OFFSET(Pro_1,0,2),MATCH(2,1/(Pro_1=$B$3),1)),ROWS(R$2:R30)),\"\")","v":""},{"$f":"IFERROR(INDEX(INDEX(OFFSET(Pro_1,0,3),MATCH($B$3,Pro_1,0)-1):INDEX(OFFSET(Pro_1,0,3),MATCH(2,1/(Pro_1=$B$3),1)),ROWS(S$2:S30)),\"\")","v":""},null,null,null,null,"","",{"$f":"IFERROR(INDEX(INDEX(Pro_2,MATCH($D$3,Pro_2,0)-1):INDEX(Pro_2,MATCH(2,1/(Pro_2=$D$3),1)),ROWS(Z$2:Z30)),\"\")","v":""},{"$f":"IFERROR(INDEX(INDEX(OFFSET(Pro_2,0,1),MATCH($D$3,Pro_2,0)-1):INDEX(OFFSET(Pro_2,0,1),MATCH(2,1/(Pro_2=$D$3),1)),ROWS(AA$2:AA30)),\"\")","v":""},{"$f":"IFERROR(INDEX(INDEX(OFFSET(Pro_2,0,2),MATCH($D$3,Pro_2,0)-1):INDEX(OFFSET(Pro_2,0,2),MATCH(2,1/(Pro_2=$D$3),1)),ROWS(AB$2:AB30)),\"\")","v":""},{"$f":"IFERROR(INDEX(INDEX(OFFSET(Pro_2,0,3),MATCH($D$3,Pro_2,0)-1):INDEX(OFFSET(Pro_2,0,3),MATCH(2,1/(Pro_2=$D$3),1)),ROWS(AC$2:AC30)),\"\")","v":""},null,null,null,"","",{"$f":"IFERROR(INDEX(INDEX(Pro_3,MATCH($F$3,Pro_3,0)-1):INDEX(Pro_3,MATCH(2,1/(Pro_3=$F$3),1)),ROWS(AI$2:AI30)),\"\")","v":""},{"$f":"IFERROR(INDEX(INDEX(OFFSET(Pro_3,0,1),MATCH($F$3,Pro_3,0)-1):INDEX(OFFSET(Pro_3,0,1),MATCH(2,1/(Pro_3=$F$3),1)),ROWS(AJ$2:AJ30)),\"\")","v":""},{"$f":"IFERROR(INDEX(INDEX(OFFSET(Pro_3,0,2),MATCH($F$3,Pro_3,0)-1):INDEX(OFFSET(Pro_3,0,2),MATCH(2,1/(Pro_3=$F$3),1)),ROWS(AK$2:AK30)),\"\")","v":""},{"$f":"IFERROR(INDEX(INDEX(OFFSET(Pro_3,0,3),MATCH($F$3,Pro_3,0)-1):INDEX(OFFSET(Pro_3,0,3),MATCH(2,1/(Pro_3=$F$3),1)),ROWS(AL$2:AL30)),\"\")","v":""}]
["LLS1",{"$f":"IF(OR(X_MILS_1=0,COUNT(OFFSET(Powr_LS_range_1,0,3))=1),\"\",X_MILS_1)","v":1052.2685185185185},{"$f":"IF(OR(B32=\"\",MIN_LS_1=0),\"\",MIN_LS_1)","v":2160},{"$f":"IF(AND(B32=\"\",C32=\"\"),\"\",A32&\";\"&ROUND(B32,0)&\";\"&ROUND(C32,0))","v":"LLS1;1052;2160"},null,null,null,null,null,"",null,null,null,"","",{"$f":"IFERROR(INDEX(INDEX(Pro_1,MATCH($B$3,Pro_1,0)-1):INDEX(Pro_1,MATCH(2,1/(Pro_1=$B$3),1)),ROWS(P$2:P31)),\"\")","v":""},{"$f":"IFERROR(INDEX(INDEX(OFFSET(Pro_1,0,1),MATCH($B$3,Pro_1,0)-1):INDEX(OFFSET(Pro_1,0,1),MATCH(2,1/(Pro_1=$B$3),1)),ROWS(Q$2:Q31)),\"\")","v":""},{"$f":"IFERROR(INDEX(INDEX(OFFSET(Pro_1,0,2),MATCH($B$3,Pro_1,0)-1):INDEX(OFFSET(Pro_1,0,2),MATCH(2,1/(Pro_1=$B$3),1)),ROWS(R$2:R31)),\"\")","v":""},{"$f":"IFERROR(INDEX(INDEX(OFFSET(Pro_1,0,3),MATCH($B$3,Pro_1,0)-1):INDEX(OFFSET(Pro_1,0,3),MATCH(2,1/(Pro_1=$B$3),1)),ROWS(S$2:S31)),\"\")","v":""},null,null,null,null,"","",{"$f":"IFERROR(INDEX(INDEX(Pro_2,MATCH($D$3,Pro_2,0)-1):INDEX(Pro_2,MATCH(2,1/(Pro_2=$D$3),1)),ROWS(Z$2:Z31)),\"\")","v":""},{"$f":"IFERROR(INDEX(INDEX(OFFSET(Pro_2,0,1),MATCH($D$3,Pro_2,0)-1):INDEX(OFFSET(Pro_2,0,1),MATCH(2,1/(Pro_2=$D$3),1)),ROWS(AA$2:AA31)),\"\")","v":""},{"$f":"IFERROR(INDEX(INDEX(OFFSET(Pro_2,0,2),MATCH($D$3,Pro_2,0)-1):INDEX(OFFSET(Pro_2,0,2),MATCH(2,1/(Pro_2=$D$3),1)),ROWS(AB$2:AB31)),\"\")","v":""},{"$f":"IFERROR(INDEX(INDEX(OFFSET(Pro_2,0,3),MATCH($D$3,Pro_2,0)-1):INDEX(OFFSET(Pro_2,0,3),MATCH(2,1/(Pro_2=$D$3),1)),ROWS(AC$2:AC31)),\"\")","v":""},null,null,null,"","",{"$f":"IFERROR(INDEX(INDEX(Pro_3,MATCH($F$3,Pro_3,0)-1):INDEX(Pro_3,MATCH(2,1/(Pro_3=$F$3),1)),ROWS(AI$2:AI31)),\"\")","v":""},{"$f":"IFERROR(INDEX(INDEX(OFFSET(Pro_3,0,1),MATCH($F$3,Pro_3,0)-1):INDEX(OFFSET(Pro_3,0,1),MATCH(2,1/(Pro_3=$F$3),1)),ROWS(AJ$2:AJ31)),\"\")","v":""},{"$f":"IFERROR(INDEX(INDEX(OFFSET(Pro_3,0,2),MATCH($F$3,Pro_3,0)-1):INDEX(OFFSET(Pro_3,0,2),MATCH(2,1/(Pro_3=$F$3),1)),ROWS(AK$2:AK31)),\"\")","v":""},{"$f":"IFERROR(INDEX(INDEX(OFFSET(Pro_3,0,3),MATCH($F$3,Pro_3,0)-1):INDEX(OFFSET(Pro_3,0,3),MATCH(2,1/(Pro_3=$F$3),1)),ROWS(AL$2:AL31)),\"\")","v":""}]
[null,null,null,null,null,null,null,null,null,"",null,null,null,"","",{"$f":"IFERROR(INDEX(INDEX(Pro_1,MATCH($B$3,Pro_1,0)-1):INDEX(Pro_1,MATCH(2,1/(Pro_1=$B$3),1)),ROWS(P$2:P32)),\"\")","v":""},{"$f":"IFERROR(INDEX(INDEX(OFFSET(Pro_1,0,1),MATCH($B$3,Pro_1,0)-1):INDEX(OFFSET(Pro_1,0,1),MATCH(2,1/(Pro_1=$B$3),1)),ROWS(Q$2:Q32)),\"\")","v":""},{"$f":"IFERROR(INDEX(INDEX(OFFSET(Pro_1,0,2),MATCH($B$3,Pro_1,0)-1):INDEX(OFFSET(Pro_1,0,2),MATCH(2,1/(Pro_1=$B$3),1)),ROWS(R$2:R32)),\"\")","v":""},{"$f":"IFERROR(INDEX(INDEX(OFFSET(Pro_1,0,3),MATCH($B$3,Pro_1,0)-1):INDEX(OFFSET(Pro_1,0,3),MATCH(2,1/(Pro_1=$B$3),1)),ROWS(S$2:S32)),\"\")","v":""},null,null,null,null,"","",{"$f":"IFERROR(INDEX(INDEX(Pro_2,MATCH($D$3,Pro_2,0)-1):INDEX(Pro_2,MATCH(2,1/(Pro_2=$D$3),1)),ROWS(Z$2:Z32)),\"\")","v":""},{"$f":"IFERROR(INDEX(INDEX(OFFSET(Pro_2,0,1),MATCH($D$3,Pro_2,0)-1):INDEX(OFFSET(Pro_2,0,1),MATCH(2,1/(Pro_2=$D$3),1)),ROWS(AA$2:AA32)),\"\")","v":""},{"$f":"IFERROR(INDEX(INDEX(OFFSET(Pro_2,0,2),MATCH($D$3,Pro_2,0)-1):INDEX(OFFSET(Pro_2,0,2),MATCH(2,1/(Pro_2=$D$3),1)),ROWS(AB$2:AB32)),\"\")","v":""},{"$f":"IFERROR(INDEX(INDEX(OFFSET(Pro_2,0,3),MATCH($D$3,Pro_2,0)-1):INDEX(OFFSET(Pro_2,0,3),MATCH(2,1/(Pro_2=$D$3),1)),ROWS(AC$2:AC32)),\"\")","v":""},null,null,null,"","",{"$f":"IFERROR(INDEX(INDEX(Pro_3,MATCH($F$3,Pro_3,0)-1):INDEX(Pro_3,MATCH(2,1/(Pro_3=$F$3),1)),ROWS(AI$2:AI32)),\"\")","v":""},{"$f":"IFERROR(INDEX(INDEX(OFFSET(Pro_3,0,1),MATCH($F$3,Pro_3,0)-1):INDEX(OFFSET(Pro_3,0,1),MATCH(2,1/(Pro_3=$F$3),1)),ROWS(AJ$2:AJ32)),\"\")","v":""},{"$f":"IFERROR(INDEX(INDEX(OFFSET(Pro_3,0,2),MATCH($F$3,Pro_3,0)-1):INDEX(OFFSET(Pro_3,0,2),MATCH(2,1/(Pro_3=$F$3),1)),ROWS(AK$2:AK32)),\"\")","v":""},{"$f":"IFERROR(INDEX(INDEX(OFFSET(Pro_3,0,3),MATCH($F$3,Pro_3,0)-1):INDEX(OFFSET(Pro_3,0,3),MATCH(2,1/(Pro_3=$F$3),1)),ROWS(AL$2:AL32)),\"\")","v":""}]
["DATALABLE","X","Y","LABLE",null,null,null,null,null,"",null,null,null,"","",{"$f":"IFERROR(INDEX(INDEX(Pro_1,MATCH($B$3,Pro_1,0)-1):INDEX(Pro_1,MATCH(2,1/(Pro_1=$B$3),1)),ROWS(P$2:P33)),\"\")","v":""},{"$f":"IFERROR(INDEX(INDEX(OFFSET(Pro_1,0,1),MATCH($B$3,Pro_1,0)-1):INDEX(OFFSET(Pro_1,0,1),MATCH(2,1/(Pro_1=$B$3),1)),ROWS(Q$2:Q33)),\"\")","v":""},{"$f":"IFERROR(INDEX(INDEX(OFFSET(Pro_1,0,2),MATCH($B$3,Pro_1,0)-1):INDEX(OFFSET(Pro_1,0,2),MATCH(2,1/(Pro_1=$B$3),1)),ROWS(R$2:R33)),\"\")","v":""},{"$f":"IFERROR(INDEX(INDEX(OFFSET(Pro_1,0,3),MATCH($B$3,Pro_1,0)-1):INDEX(OFFSET(Pro_1,0,3),MATCH(2,1/(Pro_1=$B$3),1)),ROWS(S$2:S33)),\"\")","v":""},null,null,null,null,"","",{"$f":"IFERROR(INDEX(INDEX(Pro_2,MATCH($D$3,Pro_2,0)-1):INDEX(Pro_2,MATCH(2,1/(Pro_2=$D$3),1)),ROWS(Z$2:Z33)),\"\")","v":""},{"$f":"IFERROR(INDEX(INDEX(OFFSET(Pro_2,0,1),MATCH($D$3,Pro_2,0)-1):INDEX(OFFSET(Pro_2,0,1),MATCH(2,1/(Pro_2=$D$3),1)),ROWS(AA$2:AA33)),\"\")","v":""},{"$f":"IFERROR(INDEX(INDEX(OFFSET(Pro_2,0,2),MATCH($D$3,Pro_2,0)-1):INDEX(OFFSET(Pro_2,0,2),MATCH(2,1/(Pro_2=$D$3),1)),ROWS(AB$2:AB33)),\"\")","v":""},{"$f":"IFERROR(INDEX(INDEX(OFFSET(Pro_2,0,3),MATCH($D$3,Pro_2,0)-1):INDEX(OFFSET(Pro_2,0,3),MATCH(2,1/(Pro_2=$D$3),1)),ROWS(AC$2:AC33)),\"\")","v":""},null,null,null,"","",{"$f":"IFERROR(INDEX(INDEX(Pro_3,MATCH($F$3,Pro_3,0)-1):INDEX(Pro_3,MATCH(2,1/(Pro_3=$F$3),1)),ROWS(AI$2:AI33)),\"\")","v":""},{"$f":"IFERROR(INDEX(INDEX(OFFSET(Pro_3,0,1),MATCH($F$3,Pro_3,0)-1):INDEX(OFFSET(Pro_3,0,1),MATCH(2,1/(Pro_3=$F$3),1)),ROWS(AJ$2:AJ33)),\"\")","v":""},{"$f":"IFERROR(INDEX(INDEX(OFFSET(Pro_3,0,2),MATCH($F$3,Pro_3,0)-1):INDEX(OFFSET(Pro_3,0,2),MATCH(2,1/(Pro_3=$F$3),1)),ROWS(AK$2:AK33)),\"\")","v":""},{"$f":"IFERROR(INDEX(INDEX(OFFSET(Pro_3,0,3),MATCH($F$3,Pro_3,0)-1):INDEX(OFFSET(Pro_3,0,3),MATCH(2,1/(Pro_3=$F$3),1)),ROWS(AL$2:AL33)),\"\")","v":""}]
["UHS2",{"$f":"IF(X_MAHS_2=0,\"\",X_MAHS_2)","v":""},{"$f":"IF(MAX_HS_2=0,\"\",MAX_HS_2)","v":""},{"$f":"IF(AND(B35=\"\",C35=\"\"),\"\",A35&\";\"&ROUND(B35,0)&\";\"&ROUND(C35,0))","v":""},null,null,null,null,null,"",null,null,null,null,{"$f":"IF($P35=$C$3,ROW(),\"\")","v":""},{"$f":"IFERROR(INDEX(INDEX(Pro_1,MATCH($B$3,Pro_1,0)-1):INDEX(Pro_1,MATCH(2,1/(Pro_1=$B$3),1)),ROWS(P$2:P34)),\"\")","v":""},{"$f":"IFERROR(INDEX(INDEX(OFFSET(Pro_1,0,1),MATCH($B$3,Pro_1,0)-1):INDEX(OFFSET(Pro_1,0,1),MATCH(2,1/(Pro_1=$B$3),1)),ROWS(Q$2:Q34)),\"\")","v":""},{"$f":"IFERROR(INDEX(INDEX(OFFSET(Pro_1,0,2),MATCH($B$3,Pro_1,0)-1):INDEX(OFFSET(Pro_1,0,2),MATCH(2,1/(Pro_1=$B$3),1)),ROWS(R$2:R34)),\"\")","v":""},{"$f":"IFERROR(INDEX(INDEX(OFFSET(Pro_1,0,3),MATCH($B$3,Pro_1,0)-1):INDEX(OFFSET(Pro_1,0,3),MATCH(2,1/(Pro_1=$B$3),1)),ROWS(S$2:S34)),\"\")","v":""},null,null,null,null,"",{"$f":"IF($Z35=$C$3,ROW(),\"\")","v":""},{"$f":"IFERROR(INDEX(INDEX(Pro_2,MATCH($D$3,Pro_2,0)-1):INDEX(Pro_2,MATCH(2,1/(Pro_2=$D$3),1)),ROWS(Z$2:Z34)),\"\")","v":""},{"$f":"IFERROR(INDEX(INDEX(OFFSET(Pro_2,0,1),MATCH($D$3,Pro_2,0)-1):INDEX(OFFSET(Pro_2,0,1),MATCH(2,1/(Pro_2=$D$3),1)),ROWS(AA$2:AA34)),\"\")","v":""},{"$f":"IFERROR(INDEX(INDEX(OFFSET(Pro_2,0,2),MATCH($D$3,Pro_2,0)-1):INDEX(OFFSET(Pro_2,0,2),MATCH(2,1/(Pro_2=$D$3),1)),ROWS(AB$2:AB34)),\"\")","v":""},{"$f":"IFERROR(INDEX(INDEX(OFFSET(Pro_2,0,3),MATCH($D$3,Pro_2,0)-1):INDEX(OFFSET(Pro_2,0,3),MATCH(2,1/(Pro_2=$D$3),1)),ROWS(AC$2:AC34)),\"\")","v":""},null,null,null,"",{"$f":"IF($AI35=$C$3,ROW(),\"\")","v":""},{"$f":"IFERROR(INDEX(INDEX(Pro_3,MATCH($F$3,Pro_3,0)-1):INDEX(Pro_3,MATCH(2,1/(Pro_3=$F$3),1)),ROWS(AI$2:AI34)),\"\")","v":""},{"$f":"IFERROR(INDEX(INDEX(OFFSET(Pro_3,0,1),MATCH($F$3,Pro_3,0)-1):INDEX(OFFSET(Pro_3,0,1),MATCH(2,1/(Pro_3=$F$3),1)),ROWS(AJ$2:AJ34)),\"\")","v":""},{"$f":"IFERROR(INDEX(INDEX(OFFSET(Pro_3,0,2),MATCH($F$3,Pro_3,0)-1):INDEX(OFFSET(Pro_3,0,2),MATCH(2,1/(Pro_3=$F$3),1)),ROWS(AK$2:AK34)),\"\")","v":""},{"$f":"IFERROR(INDEX(INDEX(OFFSET(Pro_3,0,3),MATCH($F$3,Pro_3,0)-1):INDEX(OFFSET(Pro_3,0,3),MATCH(2,1/(Pro_3=$F$3),1)),ROWS(AL$2:AL34)),\"\")","v":""}]
["LHS2",{"$f":"IF(X_MIHS_2=0,\"\",X_MIHS_2)","v":""},{"$f":"IF(MIN_HS_2=0,\"\",MIN_HS_2)","v":""},{"$f":"IF(AND(B36=\"\",C36=\"\"),\"\",A36&\";\"&ROUND(B36,0)&\";\"&ROUND(C36,0))","v":""},null,null,null,null,null,"",null,null,null,null,"",{"$f":"IFERROR(INDEX(INDEX(Pro_1,MATCH($B$3,Pro_1,0)-1):INDEX(Pro_1,MATCH(2,1/(Pro_1=$B$3),1)),ROWS(P$2:P35)),\"\")","v":""},{"$f":"IFERROR(INDEX(INDEX(OFFSET(Pro_1,0,1),MATCH($B$3,Pro_1,0)-1):INDEX(OFFSET(Pro_1,0,1),MATCH(2,1/(Pro_1=$B$3),1)),ROWS(Q$2:Q35)),\"\")","v":""},{"$f":"IFERROR(INDEX(INDEX(OFFSET(Pro_1,0,2),MATCH($B$3,Pro_1,0)-1):INDEX(OFFSET(Pro_1,0,2),MATCH(2,1/(Pro_1=$B$3),1)),ROWS(R$2:R35)),\"\")","v":""},{"$f":"IFERROR(INDEX(INDEX(OFFSET(Pro_1,0,3),MATCH($B$3,Pro_1,0)-1):INDEX(OFFSET(Pro_1,0,3),MATCH(2,1/(Pro_1=$B$3),1)),ROWS(S$2:S35)),\"\")","v":""},null,null,null,null,"","",{"$f":"IFERROR(INDEX(INDEX(Pro_2,MATCH($D$3,Pro_2,0)-1):INDEX(Pro_2,MATCH(2,1/(Pro_2=$D$3),1)),ROWS(Z$2:Z35)),\"\")","v":""},{"$f":"IFERROR(INDEX(INDEX(OFFSET(Pro_2,0,1),MATCH($D$3,Pro_2,0)-1):INDEX(OFFSET(Pro_2,0,1),MATCH(2,1/(Pro_2=$D$3),1)),ROWS(AA$2:AA35)),\"\")","v":""},{"$f":"IFERROR(INDEX(INDEX(OFFSET(Pro_2,0,2),MATCH($D$3,Pro_2,0)-1):INDEX(OFFSET(Pro_2,0,2),MATCH(2,1/(Pro_2=$D$3),1)),ROWS(AB$2:AB35)),\"\")","v":""},{"$f":"IFERROR(INDEX(INDEX(OFFSET(Pro_2,0,3),MATCH($D$3,Pro_2,0)-1):INDEX(OFFSET(Pro_2,0,3),MATCH(2,1/(Pro_2=$D$3),1)),ROWS(AC$2:AC35)),\"\")","v":""},null,null,null,"","",{"$f":"IFERROR(INDEX(INDEX(Pro_3,MATCH($F$3,Pro_3,0)-1):INDEX(Pro_3,MATCH(2,1/(Pro_3=$F$3),1)),ROWS(AI$2:AI35)),\"\")","v":""},{"$f":"IFERROR(INDEX(INDEX(OFFSET(Pro_3,0,1),MATCH($F$3,Pro_3,0)-1):INDEX(OFFSET(Pro_3,0,1),MATCH(2,1/(Pro_3=$F$3),1)),ROWS(AJ$2:AJ35)),\"\")","v":""},{"$f":"IFERROR(INDEX(INDEX(OFFSET(Pro_3,0,2),MATCH($F$3,Pro_3,0)-1):INDEX(OFFSET(Pro_3,0,2),MATCH(2,1/(Pro_3=$F$3),1)),ROWS(AK$2:AK35)),\"\")","v":""},{"$f":"IFERROR(INDEX(INDEX(OFFSET(Pro_3,0,3),MATCH($F$3,Pro_3,0)-1):INDEX(OFFSET(Pro_3,0,3),MATCH(2,1/(Pro_3=$F$3),1)),ROWS(AL$2:AL35)),\"\")","v":""}]
["ULS2",{"$f":"IF(OR(X_MALS_2=0,COUNT(OFFSET(Powr_LS_range_2,0,3))=1),\"\",X_MALS_2)","v":422.3794781070323},{"$f":"IF(OR(MAX_LS_2=0,B37=\"\"),\"\",MAX_LS_2)","v":2261},{"$f":"IF(AND(B37=\"\",C37=\"\"),\"\",A37&\";\"&ROUND(B37,0)&\";\"&ROUND(C37,0))","v":"ULS2;422;2261"},null,null,null,null,null,"",null,null,null,null,"",{"$f":"IFERROR(INDEX(INDEX(Pro_1,MATCH($B$3,Pro_1,0)-1):INDEX(Pro_1,MATCH(2,1/(Pro_1=$B$3),1)),ROWS(P$2:P36)),\"\")","v":""},{"$f":"IFERROR(INDEX(INDEX(OFFSET(Pro_1,0,1),MATCH($B$3,Pro_1,0)-1):INDEX(OFFSET(Pro_1,0,1),MATCH(2,1/(Pro_1=$B$3),1)),ROWS(Q$2:Q36)),\"\")","v":""},{"$f":"IFERROR(INDEX(INDEX(OFFSET(Pro_1,0,2),MATCH($B$3,Pro_1,0)-1):INDEX(OFFSET(Pro_1,0,2),MATCH(2,1/(Pro_1=$B$3),1)),ROWS(R$2:R36)),\"\")","v":""},{"$f":"IFERROR(INDEX(INDEX(OFFSET(Pro_1,0,3),MATCH($B$3,Pro_1,0)-1):INDEX(OFFSET(Pro_1,0,3),MATCH(2,1/(Pro_1=$B$3),1)),ROWS(S$2:S36)),\"\")","v":""},null,null,null,null,"","",{"$f":"IFERROR(INDEX(INDEX(Pro_2,MATCH($D$3,Pro_2,0)-1):INDEX(Pro_2,MATCH(2,1/(Pro_2=$D$3),1)),ROWS(Z$2:Z36)),\"\")","v":""},{"$f":"IFERROR(INDEX(INDEX(OFFSET(Pro_2,0,1),MATCH($D$3,Pro_2,0)-1):INDEX(OFFSET(Pro_2,0,1),MATCH(2,1/(Pro_2=$D$3),1)),ROWS(AA$2:AA36)),\"\")","v":""},{"$f":"IFERROR(INDEX(INDEX(OFFSET(Pro_2,0,2),MATCH($D$3,Pro_2,0)-1):INDEX(OFFSET(Pro_2,0,2),MATCH(2,1/(Pro_2=$D$3),1)),ROWS(AB$2:AB36)),\"\")","v":""},{"$f":"IFERROR(INDEX(INDEX(OFFSET(Pro_2,0,3),MATCH($D$3,Pro_2,0)-1):INDEX(OFFSET(Pro_2,0,3),MATCH(2,1/(Pro_2=$D$3),1)),ROWS(AC$2:AC36)),\"\")","v":""},null,null,null,"","",{"$f":"IFERROR(INDEX(INDEX(Pro_3,MATCH($F$3,Pro_3,0)-1):INDEX(Pro_3,MATCH(2,1/(Pro_3=$F$3),1)),ROWS(AI$2:AI36)),\"\")","v":""},{"$f":"IFERROR(INDEX(INDEX(OFFSET(Pro_3,0,1),MATCH($F$3,Pro_3,0)-1):INDEX(OFFSET(Pro_3,0,1),MATCH(2,1/(Pro_3=$F$3),1)),ROWS(AJ$2:AJ36)),\"\")","v":""},{"$f":"IFERROR(INDEX(INDEX(OFFSET(Pro_3,0,2),MATCH($F$3,Pro_3,0)-1):INDEX(OFFSET(Pro_3,0,2),MATCH(2,1/(Pro_3=$F$3),1)),ROWS(AK$2:AK36)),\"\")","v":""},{"$f":"IFERROR(INDEX(INDEX(OFFSET(Pro_3,0,3),MATCH($F$3,Pro_3,0)-1):INDEX(OFFSET(Pro_3,0,3),MATCH(2,1/(Pro_3=$F$3),1)),ROWS(AL$2:AL36)),\"\")","v":""}]
["LLS2",{"$f":"IF(OR(X_MILS_2=0,COUNT(OFFSET(Powr_LS_range_2,0,3))=1),\"\",X_MILS_2)","v":617.32385261797026},{"$f":"IF(OR(B38=\"\",MIN_LS_2=0),\"\",MIN_LS_2)","v":1547},{"$f":"IF(AND(B38=\"\",C38=\"\"),\"\",A38&\";\"&ROUND(B38,0)&\";\"&ROUND(C38,0))","v":"LLS2;617;1547"},null,null,null,null,null,"",null,null,null,null,"",{"$f":"IFERROR(INDEX(INDEX(Pro_1,MATCH($B$3,Pro_1,0)-1):INDEX(Pro_1,MATCH(2,1/(Pro_1=$B$3),1)),ROWS(P$2:P37)),\"\")","v":""},{"$f":"IFERROR(INDEX(INDEX(OFFSET(Pro_1,0,1),MATCH($B$3,Pro_1,0)-1):INDEX(OFFSET(Pro_1,0,1),MATCH(2,1/(Pro_1=$B$3),1)),ROWS(Q$2:Q37)),\"\")","v":""},{"$f":"IFERROR(INDEX(INDEX(OFFSET(Pro_1,0,2),MATCH($B$3,Pro_1,0)-1):INDEX(OFFSET(Pro_1,0,2),MATCH(2,1/(Pro_1=$B$3),1)),ROWS(R$2:R37)),\"\")","v":""},{"$f":"IFERROR(INDEX(INDEX(OFFSET(Pro_1,0,3),MATCH($B$3,Pro_1,0)-1):INDEX(OFFSET(Pro_1,0,3),MATCH(2,1/(Pro_1=$B$3),1)),ROWS(S$2:S37)),\"\")","v":""},null,null,null,null,"","",{"$f":"IFERROR(INDEX(INDEX(Pro_2,MATCH($D$3,Pro_2,0)-1):INDEX(Pro_2,MATCH(2,1/(Pro_2=$D$3),1)),ROWS(Z$2:Z37)),\"\")","v":""},{"$f":"IFERROR(INDEX(INDEX(OFFSET(Pro_2,0,1),MATCH($D$3,Pro_2,0)-1):INDEX(OFFSET(Pro_2,0,1),MATCH(2,1/(Pro_2=$D$3),1)),ROWS(AA$2:AA37)),\"\")","v":""},{"$f":"IFERROR(INDEX(INDEX(OFFSET(Pro_2,0,2),MATCH($D$3,Pro_2,0)-1):INDEX(OFFSET(Pro_2,0,2),MATCH(2,1/(Pro_2=$D$3),1)),ROWS(AB$2:AB37)),\"\")","v":""},{"$f":"IFERROR(INDEX(INDEX(OFFSET(Pro_2,0,3),MATCH($D$3,Pro_2,0)-1):INDEX(OFFSET(Pro_2,0,3),MATCH(2,1/(Pro_2=$D$3),1)),ROWS(AC$2:AC37)),\"\")","v":""},null,null,null,"","",{"$f":"IFERROR(INDEX(INDEX(Pro_3,MATCH($F$3,Pro_3,0)-1):INDEX(Pro_3,MATCH(2,1/(Pro_3=$F$3),1)),ROWS(AI$2:AI37)),\"\")","v":""},{"$f":"IFERROR(INDEX(INDEX(OFFSET(Pro_3,0,1),MATCH($F$3,Pro_3,0)-1):INDEX(OFFSET(Pro_3,0,1),MATCH(2,1/(Pro_3=$F$3),1)),ROWS(AJ$2:AJ37)),\"\")","v":""},{"$f":"IFERROR(INDEX(INDEX(OFFSET(Pro_3,0,2),MATCH($F$3,Pro_3,0)-1):INDEX(OFFSET(Pro_3,0,2),MATCH(2,1/(Pro_3=$F$3),1)),ROWS(AK$2:AK37)),\"\")","v":""},{"$f":"IFERROR(INDEX(INDEX(OFFSET(Pro_3,0,3),MATCH($F$3,Pro_3,0)-1):INDEX(OFFSET(Pro_3,0,3),MATCH(2,1/(Pro_3=$F$3),1)),ROWS(AL$2:AL37)),\"\")","v":""}]
[null,null,null,null,null,null,null,null,null,"",null,null,null,null,"",{"$f":"IFERROR(INDEX(INDEX(Pro_1,MATCH($B$3,Pro_1,0)-1):INDEX(Pro_1,MATCH(2,1/(Pro_1=$B$3),1)),ROWS(P$2:P38)),\"\")","v":""},{"$f":"IFERROR(INDEX(INDEX(OFFSET(Pro_1,0,1),MATCH($B$3,Pro_1,0)-1):INDEX(OFFSET(Pro_1,0,1),MATCH(2,1/(Pro_1=$B$3),1)),ROWS(Q$2:Q38)),\"\")","v":""},{"$f":"IFERROR(INDEX(INDEX(OFFSET(Pro_1,0,2),MATCH($B$3,Pro_1,0)-1):INDEX(OFFSET(Pro_1,0,2),MATCH(2,1/(Pro_1=$B$3),1)),ROWS(R$2:R38)),\"\")","v":""},{"$f":"IFERROR(INDEX(INDEX(OFFSET(Pro_1,0,3),MATCH($B$3,Pro_1,0)-1):INDEX(OFFSET(Pro_1,0,3),MATCH(2,1/(Pro_1=$B$3),1)),ROWS(S$2:S38)),\"\")","v":""},null,null,null,null,"","",{"$f":"IFERROR(INDEX(INDEX(Pro_2,MATCH($D$3,Pro_2,0)-1):INDEX(Pro_2,MATCH(2,1/(Pro_2=$D$3),1)),ROWS(Z$2:Z38)),\"\")","v":""},{"$f":"IFERROR(INDEX(INDEX(OFFSET(Pro_2,0,1),MATCH($D$3,Pro_2,0)-1):INDEX(OFFSET(Pro_2,0,1),MATCH(2,1/(Pro_2=$D$3),1)),ROWS(AA$2:AA38)),\"\")","v":""},{"$f":"IFERROR(INDEX(INDEX(OFFSET(Pro_2,0,2),MATCH($D$3,Pro_2,0)-1):INDEX(OFFSET(Pro_2,0,2),MATCH(2,1/(Pro_2=$D$3),1)),ROWS(AB$2:AB38)),\"\")","v":""},{"$f":"IFERROR(INDEX(INDEX(OFFSET(Pro_2,0,3),MATCH($D$3,Pro_2,0)-1):INDEX(OFFSET(Pro_2,0,3),MATCH(2,1/(Pro_2=$D$3),1)),ROWS(AC$2:AC38)),\"\")","v":""},null,null,null,"","",{"$f":"IFERROR(INDEX(INDEX(Pro_3,MATCH($F$3,Pro_3,0)-1):INDEX(Pro_3,MATCH(2,1/(Pro_3=$F$3),1)),ROWS(AI$2:AI38)),\"\")","v":""},{"$f":"IFERROR(INDEX(INDEX(OFFSET(Pro_3,0,1),MATCH($F$3,Pro_3,0)-1):INDEX(OFFSET(Pro_3,0,1),MATCH(2,1/(Pro_3=$F$3),1)),ROWS(AJ$2:AJ38)),\"\")","v":""},{"$f":"IFERROR(INDEX(INDEX(OFFSET(Pro_3,0,2),MATCH($F$3,Pro_3,0)-1):INDEX(OFFSET(Pro_3,0,2),MATCH(2,1/(Pro_3=$F$3),1)),ROWS(AK$2:AK38)),\"\")","v":""},{"$f":"IFERROR(INDEX(INDEX(OFFSET(Pro_3,0,3),MATCH($F$3,Pro_3,0)-1):INDEX(OFFSET(Pro_3,0,3),MATCH(2,1/(Pro_3=$F$3),1)),ROWS(AL$2:AL38)),\"\")","v":""}]
["DATALABLE","X","Y","LABLE",null,null,null,null,null,"",null,null,null,null,"",{"$f":"IFERROR(INDEX(INDEX(Pro_1,MATCH($B$3,Pro_1,0)-1):INDEX(Pro_1,MATCH(2,1/(Pro_1=$B$3),1)),ROWS(P$2:P39)),\"\")","v":""},{"$f":"IFERROR(INDEX(INDEX(OFFSET(Pro_1,0,1),MATCH($B$3,Pro_1,0)-1):INDEX(OFFSET(Pro_1,0,1),MATCH(2,1/(Pro_1=$B$3),1)),ROWS(Q$2:Q39)),\"\")","v":""},{"$f":"IFERROR(INDEX(INDEX(OFFSET(Pro_1,0,2),MATCH($B$3,Pro_1,0)-1):INDEX(OFFSET(Pro_1,0,2),MATCH(2,1/(Pro_1=$B$3),1)),ROWS(R$2:R39)),\"\")","v":""},{"$f":"IFERROR(INDEX(INDEX(OFFSET(Pro_1,0,3),MATCH($B$3,Pro_1,0)-1):INDEX(OFFSET(Pro_1,0,3),MATCH(2,1/(Pro_1=$B$3),1)),ROWS(S$2:S39)),\"\")","v":""},null,null,null,null,"","",{"$f":"IFERROR(INDEX(INDEX(Pro_2,MATCH($D$3,Pro_2,0)-1):INDEX(Pro_2,MATCH(2,1/(Pro_2=$D$3),1)),ROWS(Z$2:Z39)),\"\")","v":""},{"$f":"IFERROR(INDEX(INDEX(OFFSET(Pro_2,0,1),MATCH($D$3,Pro_2,0)-1):INDEX(OFFSET(Pro_2,0,1),MATCH(2,1/(Pro_2=$D$3),1)),ROWS(AA$2:AA39)),\"\")","v":""},{"$f":"IFERROR(INDEX(INDEX(OFFSET(Pro_2,0,2),MATCH($D$3,Pro_2,0)-1):INDEX(OFFSET(Pro_2,0,2),MATCH(2,1/(Pro_2=$D$3),1)),ROWS(AB$2:AB39)),\"\")","v":""},{"$f":"IFERROR(INDEX(INDEX(OFFSET(Pro_2,0,3),MATCH($D$3,Pro_2,0)-1):INDEX(OFFSET(Pro_2,0,3),MATCH(2,1/(Pro_2=$D$3),1)),ROWS(AC$2:AC39)),\"\")","v":""},null,null,null,"","",{"$f":"IFERROR(INDEX(INDEX(Pro_3,MATCH($F$3,Pro_3,0)-1):INDEX(Pro_3,MATCH(2,1/(Pro_3=$F$3),1)),ROWS(AI$2:AI39)),\"\")","v":""},{"$f":"IFERROR(INDEX(INDEX(OFFSET(Pro_3,0,1),MATCH($F$3,Pro_3,0)-1):INDEX(OFFSET(Pro_3,0,1),MATCH(2,1/(Pro_3=$F$3),1)),ROWS(AJ$2:AJ39)),\"\")","v":""},{"$f":"IFERROR(INDEX(INDEX(OFFSET(Pro_3,0,2),MATCH($F$3,Pro_3,0)-1):INDEX(OFFSET(Pro_3,0,2),MATCH(2,1/(Pro_3=$F$3),1)),ROWS(AK$2:AK39)),\"\")","v":""},{"$f":"IFERROR(INDEX(INDEX(OFFSET(Pro_3,0,3),MATCH($F$3,Pro_3,0)-1):INDEX(OFFSET(Pro_3,0,3),MATCH(2,1/(Pro_3=$F$3),1)),ROWS(AL$2:AL39)),\"\")","v":""}]
["UHS3",{"$f":"IF(X_MAHS_3=0,\"\",X_MAHS_3)","v":""},{"$f":"IF(MAX_HS_3=0,\"\",MAX_HS_3)","v":""},{"$f":"IF(AND(B41=\"\",C41=\"\"),\"\",A41&\";\"&ROUND(B41,0)&\";\"&ROUND(C41,0))","v":""},null,null,null,null,null,"",null,null,null,null,"",{"$f":"IFERROR(INDEX(INDEX(Pro_1,MATCH($B$3,Pro_1,0)-1):INDEX(Pro_1,MATCH(2,1/(Pro_1=$B$3),1)),ROWS(P$2:P40)),\"\")","v":""},{"$f":"IFERROR(INDEX(INDEX(OFFSET(Pro_1,0,1),MATCH($B$3,Pro_1,0)-1):INDEX(OFFSET(Pro_1,0,1),MATCH(2,1/(Pro_1=$B$3),1)),ROWS(Q$2:Q40)),\"\")","v":""},{"$f":"IFERROR(INDEX(INDEX(OFFSET(Pro_1,0,2),MATCH($B$3,Pro_1,0)-1):INDEX(OFFSET(Pro_1,0,2),MATCH(2,1/(Pro_1=$B$3),1)),ROWS(R$2:R40)),\"\")","v":""},{"$f":"IFERROR(INDEX(INDEX(OFFSET(Pro_1,0,3),MATCH($B$3,Pro_1,0)-1):INDEX(OFFSET(Pro_1,0,3),MATCH(2,1/(Pro_1=$B$3),1)),ROWS(S$2:S40)),\"\")","v":""},null,null,null,null,"","",{"$f":"IFERROR(INDEX(INDEX(Pro_2,MATCH($D$3,Pro_2,0)-1):INDEX(Pro_2,MATCH(2,1/(Pro_2=$D$3),1)),ROWS(Z$2:Z40)),\"\")","v":""},{"$f":"IFERROR(INDEX(INDEX(OFFSET(Pro_2,0,1),MATCH($D$3,Pro_2,0)-1):INDEX(OFFSET(Pro_2,0,1),MATCH(2,1/(Pro_2=$D$3),1)),ROWS(AA$2:AA40)),\"\")","v":""},{"$f":"IFERROR(INDEX(INDEX(OFFSET(Pro_2,0,2),MATCH($D$3,Pro_2,0)-1):INDEX(OFFSET(Pro_2,0,2),MATCH(2,1/(Pro_2=$D$3),1)),ROWS(AB$2:AB40)),\"\")","v":""},{"$f":"IFERROR(INDEX(INDEX(OFFSET(Pro_2,0,3),MATCH($D$3,Pro_2,0)-1):INDEX(OFFSET(Pro_2,0,3),MATCH(2,1/(Pro_2=$D$3),1)),ROWS(AC$2:AC40)),\"\")","v":""},null,null,null,"","",{"$f":"IFERROR(INDEX(INDEX(Pro_3,MATCH($F$3,Pro_3,0)-1):INDEX(Pro_3,MATCH(2,1/(Pro_3=$F$3),1)),ROWS(AI$2:AI40)),\"\")","v":""},{"$f":"IFERROR(INDEX(INDEX(OFFSET(Pro_3,0,1),MATCH($F$3,Pro_3,0)-1):INDEX(OFFSET(Pro_3,0,1),MATCH(2,1/(Pro_3=$F$3),1)),ROWS(AJ$2:AJ40)),\"\")","v":""},{"$f":"IFERROR(INDEX(INDEX(OFFSET(Pro_3,0,2),MATCH($F$3,Pro_3,0)-1):INDEX(OFFSET(Pro_3,0,2),MATCH(2,1/(Pro_3=$F$3),1)),ROWS(AK$2:AK40)),\"\")","v":""},{"$f":"IFERROR(INDEX(INDEX(OFFSET(Pro_3,0,3),MATCH($F$3,Pro_3,0)-1):INDEX(OFFSET(Pro_3,0,3),MATCH(2,1/(Pro_3=$F$3),1)),ROWS(AL$2:AL40)),\"\")","v":""}]
["LHS3",{"$f":"IF(X_MIHS_3=0,\"\",X_MIHS_3)","v":""},{"$f":"IF(MIN_HS_3=0,\"\",MIN_HS_3)","v":""},{"$f":"IF(AND(B42=\"\",C42=\"\"),\"\",A42&\";\"&ROUND(B42,0)&\";\"&ROUND(C42,0))","v":""},null,null,null,null,null,"",null,null,null,null,"",{"$f":"IFERROR(INDEX(INDEX(Pro_1,MATCH($B$3,Pro_1,0)-1):INDEX(Pro_1,MATCH(2,1/(Pro_1=$B$3),1)),ROWS(P$2:P41)),\"\")","v":""},{"$f":"IFERROR(INDEX(INDEX(OFFSET(Pro_1,0,1),MATCH($B$3,Pro_1,0)-1):INDEX(OFFSET(Pro_1,0,1),MATCH(2,1/(Pro_1=$B$3),1)),ROWS(Q$2:Q41)),\"\")","v":""},{"$f":"IFERROR(INDEX(INDEX(OFFSET(Pro_1,0,2),MATCH($B$3,Pro_1,0)-1):INDEX(OFFSET(Pro_1,0,2),MATCH(2,1/(Pro_1=$B$3),1)),ROWS(R$2:R41)),\"\")","v":""},{"$f":"IFERROR(INDEX(INDEX(OFFSET(Pro_1,0,3),MATCH($B$3,Pro_1,0)-1):INDEX(OFFSET(Pro_1,0,3),MATCH(2,1/(Pro_1=$B$3),1)),ROWS(S$2:S41)),\"\")","v":""},null,null,null,null,"","",{"$f":"IFERROR(INDEX(INDEX(Pro_2,MATCH($D$3,Pro_2,0)-1):INDEX(Pro_2,MATCH(2,1/(Pro_2=$D$3),1)),ROWS(Z$2:Z41)),\"\")","v":""},{"$f":"IFERROR(INDEX(INDEX(OFFSET(Pro_2,0,1),MATCH($D$3,Pro_2,0)-1):INDEX(OFFSET(Pro_2,0,1),MATCH(2,1/(Pro_2=$D$3),1)),ROWS(AA$2:AA41)),\"\")","v":""},{"$f":"IFERROR(INDEX(INDEX(OFFSET(Pro_2,0,2),MATCH($D$3,Pro_2,0)-1):INDEX(OFFSET(Pro_2,0,2),MATCH(2,1/(Pro_2=$D$3),1)),ROWS(AB$2:AB41)),\"\")","v":""},{"$f":"IFERROR(INDEX(INDEX(OFFSET(Pro_2,0,3),MATCH($D$3,Pro_2,0)-1):INDEX(OFFSET(Pro_2,0,3),MATCH(2,1/(Pro_2=$D$3),1)),ROWS(AC$2:AC41)),\"\")","v":""},null,null,null,"","",{"$f":"IFERROR(INDEX(INDEX(Pro_3,MATCH($F$3,Pro_3,0)-1):INDEX(Pro_3,MATCH(2,1/(Pro_3=$F$3),1)),ROWS(AI$2:AI41)),\"\")","v":""},{"$f":"IFERROR(INDEX(INDEX(OFFSET(Pro_3,0,1),MATCH($F$3,Pro_3,0)-1):INDEX(OFFSET(Pro_3,0,1),MATCH(2,1/(Pro_3=$F$3),1)),ROWS(AJ$2:AJ41)),\"\")","v":""},{"$f":"IFERROR(INDEX(INDEX(OFFSET(Pro_3,0,2),MATCH($F$3,Pro_3,0)-1):INDEX(OFFSET(Pro_3,0,2),MATCH(2,1/(Pro_3=$F$3),1)),ROWS(AK$2:AK41)),\"\")","v":""},{"$f":"IFERROR(INDEX(INDEX(OFFSET(Pro_3,0,3),MATCH($F$3,Pro_3,0)-1):INDEX(OFFSET(Pro_3,0,3),MATCH(2,1/(Pro_3=$F$3),1)),ROWS(AL$2:AL41)),\"\")","v":""}]
["ULS3",{"$f":"IF(OR(X_MALS_3=0,COUNT(OFFSET(Powr_LS_range_3,0,3))=1),\"\",X_MALS_3)","v":854.47368421052636},{"$f":"IF(OR(Max_LS_3=0,B43=\"\"),\"\",Max_LS_3)","v":1900},{"$f":"IF(AND(B43=\"\",C43=\"\"),\"\",A43&\";\"&ROUND(B43,0)&\";\"&ROUND(C43,0))","v":"ULS3;854;1900"},null,null,null,null,null,"",null,null,null,null,"",{"$f":"IFERROR(INDEX(INDEX(Pro_1,MATCH($B$3,Pro_1,0)-1):INDEX(Pro_1,MATCH(2,1/(Pro_1=$B$3),1)),ROWS(P$2:P42)),\"\")","v":""},{"$f":"IFERROR(INDEX(INDEX(OFFSET(Pro_1,0,1),MATCH($B$3,Pro_1,0)-1):INDEX(OFFSET(Pro_1,0,1),MATCH(2,1/(Pro_1=$B$3),1)),ROWS(Q$2:Q42)),\"\")","v":""},{"$f":"IFERROR(INDEX(INDEX(OFFSET(Pro_1,0,2),MATCH($B$3,Pro_1,0)-1):INDEX(OFFSET(Pro_1,0,2),MATCH(2,1/(Pro_1=$B$3),1)),ROWS(R$2:R42)),\"\")","v":""},{"$f":"IFERROR(INDEX(INDEX(OFFSET(Pro_1,0,3),MATCH($B$3,Pro_1,0)-1):INDEX(OFFSET(Pro_1,0,3),MATCH(2,1/(Pro_1=$B$3),1)),ROWS(S$2:S42)),\"\")","v":""},null,null,null,null,"","",{"$f":"IFERROR(INDEX(INDEX(Pro_2,MATCH($D$3,Pro_2,0)-1):INDEX(Pro_2,MATCH(2,1/(Pro_2=$D$3),1)),ROWS(Z$2:Z42)),\"\")","v":""},{"$f":"IFERROR(INDEX(INDEX(OFFSET(Pro_2,0,1),MATCH($D$3,Pro_2,0)-1):INDEX(OFFSET(Pro_2,0,1),MATCH(2,1/(Pro_2=$D$3),1)),ROWS(AA$2:AA42)),\"\")","v":""},{"$f":"IFERROR(INDEX(INDEX(OFFSET(Pro_2,0,2),MATCH($D$3,Pro_2,0)-1):INDEX(OFFSET(Pro_2,0,2),MATCH(2,1/(Pro_2=$D$3),1)),ROWS(AB$2:AB42)),\"\")","v":""},{"$f":"IFERROR(INDEX(INDEX(OFFSET(Pro_2,0,3),MATCH($D$3,Pro_2,0)-1):INDEX(OFFSET(Pro_2,0,3),MATCH(2,1/(Pro_2=$D$3),1)),ROWS(AC$2:AC42)),\"\")","v":""},null,null,null,"","",{"$f":"IFERROR(INDEX(INDEX(Pro_3,MATCH($F$3,Pro_3,0)-1):INDEX(Pro_3,MATCH(2,1/(Pro_3=$F$3),1)),ROWS(AI$2:AI42)),\"\")","v":""},{"$f":"IFERROR(INDEX(INDEX(OFFSET(Pro_3,0,1),MATCH($F$3,Pro_3,0)-1):INDEX(OFFSET(Pro_3,0,1),MATCH(2,1/(Pro_3=$F$3),1)),ROWS(AJ$2:AJ42)),\"\")","v":""},{"$f":"IFERROR(INDEX(INDEX(OFFSET(Pro_3,0,2),MATCH($F$3,Pro_3,0)-1):INDEX(OFFSET(Pro_3,0,2),MATCH(2,1/(Pro_3=$F$3),1)),ROWS(AK$2:AK42)),\"\")","v":""},{"$f":"IFERROR(INDEX(INDEX(OFFSET(Pro_3,0,3),MATCH($F$3,Pro_3,0)-1):INDEX(OFFSET(Pro_3,0,3),MATCH(2,1/(Pro_3=$F$3),1)),ROWS(AL$2:AL42)),\"\")","v":""}]
["LLS3",{"$f":"IF(OR(X_MILS_3=0,COUNT(OFFSET(Powr_LS_range_3,0,3))=1),\"\",X_MILS_3)","v":2029.375},{"$f":"IF(OR(B44=\"\",MIN_LS_3=0),\"\",MIN_LS_3)","v":800},{"$f":"IF(AND(B44=\"\",C44=\"\"),\"\",A44&\";\"&ROUND(B44,0)&\";\"&ROUND(C44,0))","v":"LLS3;2029;800"},null,null,null,null,null,"",null,null,null,null,"",{"$f":"IFERROR(INDEX(INDEX(Pro_1,MATCH($B$3,Pro_1,0)-1):INDEX(Pro_1,MATCH(2,1/(Pro_1=$B$3),1)),ROWS(P$2:P43)),\"\")","v":""},{"$f":"IFERROR(INDEX(INDEX(OFFSET(Pro_1,0,1),MATCH($B$3,Pro_1,0)-1):INDEX(OFFSET(Pro_1,0,1),MATCH(2,1/(Pro_1=$B$3),1)),ROWS(Q$2:Q43)),\"\")","v":""},{"$f":"IFERROR(INDEX(INDEX(OFFSET(Pro_1,0,2),MATCH($B$3,Pro_1,0)-1):INDEX(OFFSET(Pro_1,0,2),MATCH(2,1/(Pro_1=$B$3),1)),ROWS(R$2:R43)),\"\")","v":""},{"$f":"IFERROR(INDEX(INDEX(OFFSET(Pro_1,0,3),MATCH($B$3,Pro_1,0)-1):INDEX(OFFSET(Pro_1,0,3),MATCH(2,1/(Pro_1=$B$3),1)),ROWS(S$2:S43)),\"\")","v":""},null,null,null,null,"","",{"$f":"IFERROR(INDEX(INDEX(Pro_2,MATCH($D$3,Pro_2,0)-1):INDEX(Pro_2,MATCH(2,1/(Pro_2=$D$3),1)),ROWS(Z$2:Z43)),\"\")","v":""},{"$f":"IFERROR(INDEX(INDEX(OFFSET(Pro_2,0,1),MATCH($D$3,Pro_2,0)-1):INDEX(OFFSET(Pro_2,0,1),MATCH(2,1/(Pro_2=$D$3),1)),ROWS(AA$2:AA43)),\"\")","v":""},{"$f":"IFERROR(INDEX(INDEX(OFFSET(Pro_2,0,2),MATCH($D$3,Pro_2,0)-1):INDEX(OFFSET(Pro_2,0,2),MATCH(2,1/(Pro_2=$D$3),1)),ROWS(AB$2:AB43)),\"\")","v":""},{"$f":"IFERROR(INDEX(INDEX(OFFSET(Pro_2,0,3),MATCH($D$3,Pro_2,0)-1):INDEX(OFFSET(Pro_2,0,3),MATCH(2,1/(Pro_2=$D$3),1)),ROWS(AC$2:AC43)),\"\")","v":""},null,null,null,"","",{"$f":"IFERROR(INDEX(INDEX(Pro_3,MATCH($F$3,Pro_3,0)-1):INDEX(Pro_3,MATCH(2,1/(Pro_3=$F$3),1)),ROWS(AI$2:AI43)),\"\")","v":""},{"$f":"IFERROR(INDEX(INDEX(OFFSET(Pro_3,0,1),MATCH($F$3,Pro_3,0)-1):INDEX(OFFSET(Pro_3,0,1),MATCH(2,1/(Pro_3=$F$3),1)),ROWS(AJ$2:AJ43)),\"\")","v":""},{"$f":"IFERROR(INDEX(INDEX(OFFSET(Pro_3,0,2),MATCH($F$3,Pro_3,0)-1):INDEX(OFFSET(Pro_3,0,2),MATCH(2,1/(Pro_3=$F$3),1)),ROWS(AK$2:AK43)),\"\")","v":""},{"$f":"IFERROR(INDEX(INDEX(OFFSET(Pro_3,0,3),MATCH($F$3,Pro_3,0)-1):INDEX(OFFSET(Pro_3,0,3),MATCH(2,1/(Pro_3=$F$3),1)),ROWS(AL$2:AL43)),\"\")","v":""}]
[null,null,null,null,null,null,null,null,null,"",null,null,null,null,"",{"$f":"IFERROR(INDEX(INDEX(Pro_1,MATCH($B$3,Pro_1,0)-1):INDEX(Pro_1,MATCH(2,1/(Pro_1=$B$3),1)),ROWS(P$2:P44)),\"\")","v":""},{"$f":"IFERROR(INDEX(INDEX(OFFSET(Pro_1,0,1),MATCH($B$3,Pro_1,0)-1):INDEX(OFFSET(Pro_1,0,1),MATCH(2,1/(Pro_1=$B$3),1)),ROWS(Q$2:Q44)),\"\")","v":""},{"$f":"IFERROR(INDEX(INDEX(OFFSET(Pro_1,0,2),MATCH($B$3,Pro_1,0)-1):INDEX(OFFSET(Pro_1,0,2),MATCH(2,1/(Pro_1=$B$3),1)),ROWS(R$2:R44)),\"\")","v":""},{"$f":"IFERROR(INDEX(INDEX(OFFSET(Pro_1,0,3),MATCH($B$3,Pro_1,0)-1):INDEX(OFFSET(Pro_1,0,3),MATCH(2,1/(Pro_1=$B$3),1)),ROWS(S$2:S44)),\"\")","v":""},null,null,null,null,"","",{"$f":"IFERROR(INDEX(INDEX(Pro_2,MATCH($D$3,Pro_2,0)-1):INDEX(Pro_2,MATCH(2,1/(Pro_2=$D$3),1)),ROWS(Z$2:Z44)),\"\")","v":""},{"$f":"IFERROR(INDEX(INDEX(OFFSET(Pro_2,0,1),MATCH($D$3,Pro_2,0)-1):INDEX(OFFSET(Pro_2,0,1),MATCH(2,1/(Pro_2=$D$3),1)),ROWS(AA$2:AA44)),\"\")","v":""},{"$f":"IFERROR(INDEX(INDEX(OFFSET(Pro_2,0,2),MATCH($D$3,Pro_2,0)-1):INDEX(OFFSET(Pro_2,0,2),MATCH(2,1/(Pro_2=$D$3),1)),ROWS(AB$2:AB44)),\"\")","v":""},{"$f":"IFERROR(INDEX(INDEX(OFFSET(Pro_2,0,3),MATCH($D$3,Pro_2,0)-1):INDEX(OFFSET(Pro_2,0,3),MATCH(2,1/(Pro_2=$D$3),1)),ROWS(AC$2:AC44)),\"\")","v":""},null,null,null,"","",{"$f":"IFERROR(INDEX(INDEX(Pro_3,MATCH($F$3,Pro_3,0)-1):INDEX(Pro_3,MATCH(2,1/(Pro_3=$F$3),1)),ROWS(AI$2:AI44)),\"\")","v":""},{"$f":"IFERROR(INDEX(INDEX(OFFSET(Pro_3,0,1),MATCH($F$3,Pro_3,0)-1):INDEX(OFFSET(Pro_3,0,1),MATCH(2,1/(Pro_3=$F$3),1)),ROWS(AJ$2:AJ44)),\"\")","v":""},{"$f":"IFERROR(INDEX(INDEX(OFFSET(Pro_3,0,2),MATCH($F$3,Pro_3,0)-1):INDEX(OFFSET(Pro_3,0,2),MATCH(2,1/(Pro_3=$F$3),1)),ROWS(AK$2:AK44)),\"\")","v":""},{"$f":"IFERROR(INDEX(INDEX(OFFSET(Pro_3,0,3),MATCH($F$3,Pro_3,0)-1):INDEX(OFFSET(Pro_3,0,3),MATCH(2,1/(Pro_3=$F$3),1)),ROWS(AL$2:AL44)),\"\")","v":""}]
[null,null,null,null,null,null,null,null,null,"",null,null,null,null,"",{"$f":"IFERROR(INDEX(INDEX(Pro_1,MATCH($B$3,Pro_1,0)-1):INDEX(Pro_1,MATCH(2,1/(Pro_1=$B$3),1)),ROWS(P$2:P45)),\"\")","v":""},{"$f":"IFERROR(INDEX(INDEX(OFFSET(Pro_1,0,1),MATCH($B$3,Pro_1,0)-1):INDEX(OFFSET(Pro_1,0,1),MATCH(2,1/(Pro_1=$B$3),1)),ROWS(Q$2:Q45)),\"\")","v":""},{"$f":"IFERROR(INDEX(INDEX(OFFSET(Pro_1,0,2),MATCH($B$3,Pro_1,0)-1):INDEX(OFFSET(Pro_1,0,2),MATCH(2,1/(Pro_1=$B$3),1)),ROWS(R$2:R45)),\"\")","v":""},{"$f":"IFERROR(INDEX(INDEX(OFFSET(Pro_1,0,3),MATCH($B$3,Pro_1,0)-1):INDEX(OFFSET(Pro_1,0,3),MATCH(2,1/(Pro_1=$B$3),1)),ROWS(S$2:S45)),\"\")","v":""},null,null,null,null,"","",{"$f":"IFERROR(INDEX(INDEX(Pro_2,MATCH($D$3,Pro_2,0)-1):INDEX(Pro_2,MATCH(2,1/(Pro_2=$D$3),1)),ROWS(Z$2:Z45)),\"\")","v":""},{"$f":"IFERROR(INDEX(INDEX(OFFSET(Pro_2,0,1),MATCH($D$3,Pro_2,0)-1):INDEX(OFFSET(Pro_2,0,1),MATCH(2,1/(Pro_2=$D$3),1)),ROWS(AA$2:AA45)),\"\")","v":""},{"$f":"IFERROR(INDEX(INDEX(OFFSET(Pro_2,0,2),MATCH($D$3,Pro_2,0)-1):INDEX(OFFSET(Pro_2,0,2),MATCH(2,1/(Pro_2=$D$3),1)),ROWS(AB$2:AB45)),\"\")","v":""},{"$f":"IFERROR(INDEX(INDEX(OFFSET(Pro_2,0,3),MATCH($D$3,Pro_2,0)-1):INDEX(OFFSET(Pro_2,0,3),MATCH(2,1/(Pro_2=$D$3),1)),ROWS(AC$2:AC45)),\"\")","v":""},null,null,null,"","",{"$f":"IFERROR(INDEX(INDEX(Pro_3,MATCH($F$3,Pro_3,0)-1):INDEX(Pro_3,MATCH(2,1/(Pro_3=$F$3),1)),ROWS(AI$2:AI45)),\"\")","v":""},{"$f":"IFERROR(INDEX(INDEX(OFFSET(Pro_3,0,1),MATCH($F$3,Pro_3,0)-1):INDEX(OFFSET(Pro_3,0,1),MATCH(2,1/(Pro_3=$F$3),1)),ROWS(AJ$2:AJ45)),\"\")","v":""},{"$f":"IFERROR(INDEX(INDEX(OFFSET(Pro_3,0,2),MATCH($F$3,Pro_3,0)-1):INDEX(OFFSET(Pro_3,0,2),MATCH(2,1/(Pro_3=$F$3),1)),ROWS(AK$2:AK45)),\"\")","v":""},{"$f":"IFERROR(INDEX(INDEX(OFFSET(Pro_3,0,3),MATCH($F$3,Pro_3,0)-1):INDEX(OFFSET(Pro_3,0,3),MATCH(2,1/(Pro_3=$F$3),1)),ROWS(AL$2:AL45)),\"\")","v":""}]
[null,null,null,null,null,null,null,null,null,"",null,null,null,null,"",{"$f":"IFERROR(INDEX(INDEX(Pro_1,MATCH($B$3,Pro_1,0)-1):INDEX(Pro_1,MATCH(2,1/(Pro_1=$B$3),1)),ROWS(P$2:P46)),\"\")","v":""},{"$f":"IFERROR(INDEX(INDEX(OFFSET(Pro_1,0,1),MATCH($B$3,Pro_1,0)-1):INDEX(OFFSET(Pro_1,0,1),MATCH(2,1/(Pro_1=$B$3),1)),ROWS(Q$2:Q46)),\"\")","v":""},{"$f":"IFERROR(INDEX(INDEX(OFFSET(Pro_1,0,2),MATCH($B$3,Pro_1,0)-1):INDEX(OFFSET(Pro_1,0,2),MATCH(2,1/(Pro_1=$B$3),1)),ROWS(R$2:R46)),\"\")","v":""},{"$f":"IFERROR(INDEX(INDEX(OFFSET(Pro_1,0,3),MATCH($B$3,Pro_1,0)-1):INDEX(OFFSET(Pro_1,0,3),MATCH(2,1/(Pro_1=$B$3),1)),ROWS(S$2:S46)),\"\")","v":""},null,null,null,null,"","",{"$f":"IFERROR(INDEX(INDEX(Pro_2,MATCH($D$3,Pro_2,0)-1):INDEX(Pro_2,MATCH(2,1/(Pro_2=$D$3),1)),ROWS(Z$2:Z46)),\"\")","v":""},{"$f":"IFERROR(INDEX(INDEX(OFFSET(Pro_2,0,1),MATCH($D$3,Pro_2,0)-1):INDEX(OFFSET(Pro_2,0,1),MATCH(2,1/(Pro_2=$D$3),1)),ROWS(AA$2:AA46)),\"\")","v":""},{"$f":"IFERROR(INDEX(INDEX(OFFSET(Pro_2,0,2),MATCH($D$3,Pro_2,0)-1):INDEX(OFFSET(Pro_2,0,2),MATCH(2,1/(Pro_2=$D$3),1)),ROWS(AB$2:AB46)),\"\")","v":""},{"$f":"IFERROR(INDEX(INDEX(OFFSET(Pro_2,0,3),MATCH($D$3,Pro_2,0)-1):INDEX(OFFSET(Pro_2,0,3),MATCH(2,1/(Pro_2=$D$3),1)),ROWS(AC$2:AC46)),\"\")","v":""},null,null,null,"","",{"$f":"IFERROR(INDEX(INDEX(Pro_3,MATCH($F$3,Pro_3,0)-1):INDEX(Pro_3,MATCH(2,1/(Pro_3=$F$3),1)),ROWS(AI$2:AI46)),\"\")","v":""},{"$f":"IFERROR(INDEX(INDEX(OFFSET(Pro_3,0,1),MATCH($F$3,Pro_3,0)-1):INDEX(OFFSET(Pro_3,0,1),MATCH(2,1/(Pro_3=$F$3),1)),ROWS(AJ$2:AJ46)),\"\")","v":""},{"$f":"IFERROR(INDEX(INDEX(OFFSET(Pro_3,0,2),MATCH($F$3,Pro_3,0)-1):INDEX(OFFSET(Pro_3,0,2),MATCH(2,1/(Pro_3=$F$3),1)),ROWS(AK$2:AK46)),\"\")","v":""},{"$f":"IFERROR(INDEX(INDEX(OFFSET(Pro_3,0,3),MATCH($F$3,Pro_3,0)-1):INDEX(OFFSET(Pro_3,0,3),MATCH(2,1/(Pro_3=$F$3),1)),ROWS(AL$2:AL46)),\"\")","v":""}]
[null,null,null,null,null,null,null,null,null,"",null,null,null,null,"",{"$f":"IFERROR(INDEX(INDEX(Pro_1,MATCH($B$3,Pro_1,0)-1):INDEX(Pro_1,MATCH(2,1/(Pro_1=$B$3),1)),ROWS(P$2:P47)),\"\")","v":""},{"$f":"IFERROR(INDEX(INDEX(OFFSET(Pro_1,0,1),MATCH($B$3,Pro_1,0)-1):INDEX(OFFSET(Pro_1,0,1),MATCH(2,1/(Pro_1=$B$3),1)),ROWS(Q$2:Q47)),\"\")","v":""},{"$f":"IFERROR(INDEX(INDEX(OFFSET(Pro_1,0,2),MATCH($B$3,Pro_1,0)-1):INDEX(OFFSET(Pro_1,0,2),MATCH(2,1/(Pro_1=$B$3),1)),ROWS(R$2:R47)),\"\")","v":""},{"$f":"IFERROR(INDEX(INDEX(OFFSET(Pro_1,0,3),MATCH($B$3,Pro_1,0)-1):INDEX(OFFSET(Pro_1,0,3),MATCH(2,1/(Pro_1=$B$3),1)),ROWS(S$2:S47)),\"\")","v":""},null,null,null,null,"","",{"$f":"IFERROR(INDEX(INDEX(Pro_2,MATCH($D$3,Pro_2,0)-1):INDEX(Pro_2,MATCH(2,1/(Pro_2=$D$3),1)),ROWS(Z$2:Z47)),\"\")","v":""},{"$f":"IFERROR(INDEX(INDEX(OFFSET(Pro_2,0,1),MATCH($D$3,Pro_2,0)-1):INDEX(OFFSET(Pro_2,0,1),MATCH(2,1/(Pro_2=$D$3),1)),ROWS(AA$2:AA47)),\"\")","v":""},{"$f":"IFERROR(INDEX(INDEX(OFFSET(Pro_2,0,2),MATCH($D$3,Pro_2,0)-1):INDEX(OFFSET(Pro_2,0,2),MATCH(2,1/(Pro_2=$D$3),1)),ROWS(AB$2:AB47)),\"\")","v":""},{"$f":"IFERROR(INDEX(INDEX(OFFSET(Pro_2,0,3),MATCH($D$3,Pro_2,0)-1):INDEX(OFFSET(Pro_2,0,3),MATCH(2,1/(Pro_2=$D$3),1)),ROWS(AC$2:AC47)),\"\")","v":""},null,null,null,"","",{"$f":"IFERROR(INDEX(INDEX(Pro_3,MATCH($F$3,Pro_3,0)-1):INDEX(Pro_3,MATCH(2,1/(Pro_3=$F$3),1)),ROWS(AI$2:AI47)),\"\")","v":""},{"$f":"IFERROR(INDEX(INDEX(OFFSET(Pro_3,0,1),MATCH($F$3,Pro_3,0)-1):INDEX(OFFSET(Pro_3,0,1),MATCH(2,1/(Pro_3=$F$3),1)),ROWS(AJ$2:AJ47)),\"\")","v":""},{"$f":"IFERROR(INDEX(INDEX(OFFSET(Pro_3,0,2),MATCH($F$3,Pro_3,0)-1):INDEX(OFFSET(Pro_3,0,2),MATCH(2,1/(Pro_3=$F$3),1)),ROWS(AK$2:AK47)),\"\")","v":""},{"$f":"IFERROR(INDEX(INDEX(OFFSET(Pro_3,0,3),MATCH($F$3,Pro_3,0)-1):INDEX(OFFSET(Pro_3,0,3),MATCH(2,1/(Pro_3=$F$3),1)),ROWS(AL$2:AL47)),\"\")","v":""}]
[null,null,null,null,null,null,null,null,null,"",null,null,null,null,"",{"$f":"IFERROR(INDEX(INDEX(Pro_1,MATCH($B$3,Pro_1,0)-1):INDEX(Pro_1,MATCH(2,1/(Pro_1=$B$3),1)),ROWS(P$2:P48)),\"\")","v":""},{"$f":"IFERROR(INDEX(INDEX(OFFSET(Pro_1,0,1),MATCH($B$3,Pro_1,0)-1):INDEX(OFFSET(Pro_1,0,1),MATCH(2,1/(Pro_1=$B$3),1)),ROWS(Q$2:Q48)),\"\")","v":""},{"$f":"IFERROR(INDEX(INDEX(OFFSET(Pro_1,0,2),MATCH($B$3,Pro_1,0)-1):INDEX(OFFSET(Pro_1,0,2),MATCH(2,1/(Pro_1=$B$3),1)),ROWS(R$2:R48)),\"\")","v":""},{"$f":"IFERROR(INDEX(INDEX(OFFSET(Pro_1,0,3),MATCH($B$3,Pro_1,0)-1):INDEX(OFFSET(Pro_1,0,3),MATCH(2,1/(Pro_1=$B$3),1)),ROWS(S$2:S48)),\"\")","v":""},null,null,null,null,"","",{"$f":"IFERROR(INDEX(INDEX(Pro_2,MATCH($D$3,Pro_2,0)-1):INDEX(Pro_2,MATCH(2,1/(Pro_2=$D$3),1)),ROWS(Z$2:Z48)),\"\")","v":""},{"$f":"IFERROR(INDEX(INDEX(OFFSET(Pro_2,0,1),MATCH($D$3,Pro_2,0)-1):INDEX(OFFSET(Pro_2,0,1),MATCH(2,1/(Pro_2=$D$3),1)),ROWS(AA$2:AA48)),\"\")","v":""},{"$f":"IFERROR(INDEX(INDEX(OFFSET(Pro_2,0,2),MATCH($D$3,Pro_2,0)-1):INDEX(OFFSET(Pro_2,0,2),MATCH(2,1/(Pro_2=$D$3),1)),ROWS(AB$2:AB48)),\"\")","v":""},{"$f":"IFERROR(INDEX(INDEX(OFFSET(Pro_2,0,3),MATCH($D$3,Pro_2,0)-1):INDEX(OFFSET(Pro_2,0,3),MATCH(2,1/(Pro_2=$D$3),1)),ROWS(AC$2:AC48)),\"\")","v":""},null,null,null,"","",{"$f":"IFERROR(INDEX(INDEX(Pro_3,MATCH($F$3,Pro_3,0)-1):INDEX(Pro_3,MATCH(2,1/(Pro_3=$F$3),1)),ROWS(AI$2:AI48)),\"\")","v":""},{"$f":"IFERROR(INDEX(INDEX(OFFSET(Pro_3,0,1),MATCH($F$3,Pro_3,0)-1):INDEX(OFFSET(Pro_3,0,1),MATCH(2,1/(Pro_3=$F$3),1)),ROWS(AJ$2:AJ48)),\"\")","v":""},{"$f":"IFERROR(INDEX(INDEX(OFFSET(Pro_3,0,2),MATCH($F$3,Pro_3,0)-1):INDEX(OFFSET(Pro_3,0,2),MATCH(2,1/(Pro_3=$F$3),1)),ROWS(AK$2:AK48)),\"\")","v":""},{"$f":"IFERROR(INDEX(INDEX(OFFSET(Pro_3,0,3),MATCH($F$3,Pro_3,0)-1):INDEX(OFFSET(Pro_3,0,3),MATCH(2,1/(Pro_3=$F$3),1)),ROWS(AL$2:AL48)),\"\")","v":""}]
[null,null,null,null,null,null,null,null,null,"",null,null,null,null,"",{"$f":"IFERROR(INDEX(INDEX(Pro_1,MATCH($B$3,Pro_1,0)-1):INDEX(Pro_1,MATCH(2,1/(Pro_1=$B$3),1)),ROWS(P$2:P49)),\"\")","v":""},{"$f":"IFERROR(INDEX(INDEX(OFFSET(Pro_1,0,1),MATCH($B$3,Pro_1,0)-1):INDEX(OFFSET(Pro_1,0,1),MATCH(2,1/(Pro_1=$B$3),1)),ROWS(Q$2:Q49)),\"\")","v":""},{"$f":"IFERROR(INDEX(INDEX(OFFSET(Pro_1,0,2),MATCH($B$3,Pro_1,0)-1):INDEX(OFFSET(Pro_1,0,2),MATCH(2,1/(Pro_1=$B$3),1)),ROWS(R$2:R49)),\"\")","v":""},{"$f":"IFERROR(INDEX(INDEX(OFFSET(Pro_1,0,3),MATCH($B$3,Pro_1,0)-1):INDEX(OFFSET(Pro_1,0,3),MATCH(2,1/(Pro_1=$B$3),1)),ROWS(S$2:S49)),\"\")","v":""},null,null,null,null,"","",{"$f":"IFERROR(INDEX(INDEX(Pro_2,MATCH($D$3,Pro_2,0)-1):INDEX(Pro_2,MATCH(2,1/(Pro_2=$D$3),1)),ROWS(Z$2:Z49)),\"\")","v":""},{"$f":"IFERROR(INDEX(INDEX(OFFSET(Pro_2,0,1),MATCH($D$3,Pro_2,0)-1):INDEX(OFFSET(Pro_2,0,1),MATCH(2,1/(Pro_2=$D$3),1)),ROWS(AA$2:AA49)),\"\")","v":""},{"$f":"IFERROR(INDEX(INDEX(OFFSET(Pro_2,0,2),MATCH($D$3,Pro_2,0)-1):INDEX(OFFSET(Pro_2,0,2),MATCH(2,1/(Pro_2=$D$3),1)),ROWS(AB$2:AB49)),\"\")","v":""},{"$f":"IFERROR(INDEX(INDEX(OFFSET(Pro_2,0,3),MATCH($D$3,Pro_2,0)-1):INDEX(OFFSET(Pro_2,0,3),MATCH(2,1/(Pro_2=$D$3),1)),ROWS(AC$2:AC49)),\"\")","v":""},null,null,null,"","",{"$f":"IFERROR(INDEX(INDEX(Pro_3,MATCH($F$3,Pro_3,0)-1):INDEX(Pro_3,MATCH(2,1/(Pro_3=$F$3),1)),ROWS(AI$2:AI49)),\"\")","v":""},{"$f":"IFERROR(INDEX(INDEX(OFFSET(Pro_3,0,1),MATCH($F$3,Pro_3,0)-1):INDEX(OFFSET(Pro_3,0,1),MATCH(2,1/(Pro_3=$F$3),1)),ROWS(AJ$2:AJ49)),\"\")","v":""},{"$f":"IFERROR(INDEX(INDEX(OFFSET(Pro_3,0,2),MATCH($F$3,Pro_3,0)-1):INDEX(OFFSET(Pro_3,0,2),MATCH(2,1/(Pro_3=$F$3),1)),ROWS(AK$2:AK49)),\"\")","v":""},{"$f":"IFERROR(INDEX(INDEX(OFFSET(Pro_3,0,3),MATCH($F$3,Pro_3,0)-1):INDEX(OFFSET(Pro_3,0,3),MATCH(2,1/(Pro_3=$F$3),1)),ROWS(AL$2:AL49)),\"\")","v":""}]
[null,null,null,null,null,null,null,null,null,"",null,null,null,null,"",{"$f":"IFERROR(INDEX(INDEX(Pro_1,MATCH($B$3,Pro_1,0)-1):INDEX(Pro_1,MATCH(2,1/(Pro_1=$B$3),1)),ROWS(P$2:P50)),\"\")","v":""},{"$f":"IFERROR(INDEX(INDEX(OFFSET(Pro_1,0,1),MATCH($B$3,Pro_1,0)-1):INDEX(OFFSET(Pro_1,0,1),MATCH(2,1/(Pro_1=$B$3),1)),ROWS(Q$2:Q50)),\"\")","v":""},{"$f":"IFERROR(INDEX(INDEX(OFFSET(Pro_1,0,2),MATCH($B$3,Pro_1,0)-1):INDEX(OFFSET(Pro_1,0,2),MATCH(2,1/(Pro_1=$B$3),1)),ROWS(R$2:R50)),\"\")","v":""},{"$f":"IFERROR(INDEX(INDEX(OFFSET(Pro_1,0,3),MATCH($B$3,Pro_1,0)-1):INDEX(OFFSET(Pro_1,0,3),MATCH(2,1/(Pro_1=$B$3),1)),ROWS(S$2:S50)),\"\")","v":""},null,null,null,null,"","",{"$f":"IFERROR(INDEX(INDEX(Pro_2,MATCH($D$3,Pro_2,0)-1):INDEX(Pro_2,MATCH(2,1/(Pro_2=$D$3),1)),ROWS(Z$2:Z50)),\"\")","v":""},{"$f":"IFERROR(INDEX(INDEX(OFFSET(Pro_2,0,1),MATCH($D$3,Pro_2,0)-1):INDEX(OFFSET(Pro_2,0,1),MATCH(2,1/(Pro_2=$D$3),1)),ROWS(AA$2:AA50)),\"\")","v":""},{"$f":"IFERROR(INDEX(INDEX(OFFSET(Pro_2,0,2),MATCH($D$3,Pro_2,0)-1):INDEX(OFFSET(Pro_2,0,2),MATCH(2,1/(Pro_2=$D$3),1)),ROWS(AB$2:AB50)),\"\")","v":""},{"$f":"IFERROR(INDEX(INDEX(OFFSET(Pro_2,0,3),MATCH($D$3,Pro_2,0)-1):INDEX(OFFSET(Pro_2,0,3),MATCH(2,1/(Pro_2=$D$3),1)),ROWS(AC$2:AC50)),\"\")","v":""},null,null,null,"","",{"$f":"IFERROR(INDEX(INDEX(Pro_3,MATCH($F$3,Pro_3,0)-1):INDEX(Pro_3,MATCH(2,1/(Pro_3=$F$3),1)),ROWS(AI$2:AI50)),\"\")","v":""},{"$f":"IFERROR(INDEX(INDEX(OFFSET(Pro_3,0,1),MATCH($F$3,Pro_3,0)-1):INDEX(OFFSET(Pro_3,0,1),MATCH(2,1/(Pro_3=$F$3),1)),ROWS(AJ$2:AJ50)),\"\")","v":""},{"$f":"IFERROR(INDEX(INDEX(OFFSET(Pro_3,0,2),MATCH($F$3,Pro_3,0)-1):INDEX(OFFSET(Pro_3,0,2),MATCH(2,1/(Pro_3=$F$3),1)),ROWS(AK$2:AK50)),\"\")","v":""},{"$f":"IFERROR(INDEX(INDEX(OFFSET(Pro_3,0,3),MATCH($F$3,Pro_3,0)-1):INDEX(OFFSET(Pro_3,0,3),MATCH(2,1/(Pro_3=$F$3),1)),ROWS(AL$2:AL50)),\"\")","v":""}]
[null,null,null,null,null,null,null,null,null,"",null,null,null,null,"",{"$f":"IFERROR(INDEX(INDEX(Pro_1,MATCH($B$3,Pro_1,0)-1):INDEX(Pro_1,MATCH(2,1/(Pro_1=$B$3),1)),ROWS(P$2:P51)),\"\")","v":""},{"$f":"IFERROR(INDEX(INDEX(OFFSET(Pro_1,0,1),MATCH($B$3,Pro_1,0)-1):INDEX(OFFSET(Pro_1,0,1),MATCH(2,1/(Pro_1=$B$3),1)),ROWS(Q$2:Q51)),\"\")","v":""},{"$f":"IFERROR(INDEX(INDEX(OFFSET(Pro_1,0,2),MATCH($B$3,Pro_1,0)-1):INDEX(OFFSET(Pro_1,0,2),MATCH(2,1/(Pro_1=$B$3),1)),ROWS(R$2:R51)),\"\")","v":""},{"$f":"IFERROR(INDEX(INDEX(OFFSET(Pro_1,0,3),MATCH($B$3,Pro_1,0)-1):INDEX(OFFSET(Pro_1,0,3),MATCH(2,1/(Pro_1=$B$3),1)),ROWS(S$2:S51)),\"\")","v":""},null,null,null,null,"","",{"$f":"IFERROR(INDEX(INDEX(Pro_2,MATCH($D$3,Pro_2,0)-1):INDEX(Pro_2,MATCH(2,1/(Pro_2=$D$3),1)),ROWS(Z$2:Z51)),\"\")","v":""},{"$f":"IFERROR(INDEX(INDEX(OFFSET(Pro_2,0,1),MATCH($D$3,Pro_2,0)-1):INDEX(OFFSET(Pro_2,0,1),MATCH(2,1/(Pro_2=$D$3),1)),ROWS(AA$2:AA51)),\"\")","v":""},{"$f":"IFERROR(INDEX(INDEX(OFFSET(Pro_2,0,2),MATCH($D$3,Pro_2,0)-1):INDEX(OFFSET(Pro_2,0,2),MATCH(2,1/(Pro_2=$D$3),1)),ROWS(AB$2:AB51)),\"\")","v":""},{"$f":"IFERROR(INDEX(INDEX(OFFSET(Pro_2,0,3),MATCH($D$3,Pro_2,0)-1):INDEX(OFFSET(Pro_2,0,3),MATCH(2,1/(Pro_2=$D$3),1)),ROWS(AC$2:AC51)),\"\")","v":""},null,null,null,"","",{"$f":"IFERROR(INDEX(INDEX(Pro_3,MATCH($F$3,Pro_3,0)-1):INDEX(Pro_3,MATCH(2,1/(Pro_3=$F$3),1)),ROWS(AI$2:AI51)),\"\")","v":""},{"$f":"IFERROR(INDEX(INDEX(OFFSET(Pro_3,0,1),MATCH($F$3,Pro_3,0)-1):INDEX(OFFSET(Pro_3,0,1),MATCH(2,1/(Pro_3=$F$3),1)),ROWS(AJ$2:AJ51)),\"\")","v":""},{"$f":"IFERROR(INDEX(INDEX(OFFSET(Pro_3,0,2),MATCH($F$3,Pro_3,0)-1):INDEX(OFFSET(Pro_3,0,2),MATCH(2,1/(Pro_3=$F$3),1)),ROWS(AK$2:AK51)),\"\")","v":""},{"$f":"IFERROR(INDEX(INDEX(OFFSET(Pro_3,0,3),MATCH($F$3,Pro_3,0)-1):INDEX(OFFSET(Pro_3,0,3),MATCH(2,1/(Pro_3=$F$3),1)),ROWS(AL$2:AL51)),\"\")","v":""}]
[null,null,null,null,null,null,null,null,null,"",null,null,null,null,"",{"$f":"IFERROR(INDEX(INDEX(Pro_1,MATCH($B$3,Pro_1,0)-1):INDEX(Pro_1,MATCH(2,1/(Pro_1=$B$3),1)),ROWS(P$2:P52)),\"\")","v":""},{"$f":"IFERROR(INDEX(INDEX(OFFSET(Pro_1,0,1),MATCH($B$3,Pro_1,0)-1):INDEX(OFFSET(Pro_1,0,1),MATCH(2,1/(Pro_1=$B$3),1)),ROWS(Q$2:Q52)),\"\")","v":""},{"$f":"IFERROR(INDEX(INDEX(OFFSET(Pro_1,0,2),MATCH($B$3,Pro_1,0)-1):INDEX(OFFSET(Pro_1,0,2),MATCH(2,1/(Pro_1=$B$3),1)),ROWS(R$2:R52)),\"\")","v":""},{"$f":"IFERROR(INDEX(INDEX(OFFSET(Pro_1,0,3),MATCH($B$3,Pro_1,0)-1):INDEX(OFFSET(Pro_1,0,3),MATCH(2,1/(Pro_1=$B$3),1)),ROWS(S$2:S52)),\"\")","v":""},null,null,null,null,"","",{"$f":"IFERROR(INDEX(INDEX(Pro_2,MATCH($D$3,Pro_2,0)-1):INDEX(Pro_2,MATCH(2,1/(Pro_2=$D$3),1)),ROWS(Z$2:Z52)),\"\")","v":""},{"$f":"IFERROR(INDEX(INDEX(OFFSET(Pro_2,0,1),MATCH($D$3,Pro_2,0)-1):INDEX(OFFSET(Pro_2,0,1),MATCH(2,1/(Pro_2=$D$3),1)),ROWS(AA$2:AA52)),\"\")","v":""},{"$f":"IFERROR(INDEX(INDEX(OFFSET(Pro_2,0,2),MATCH($D$3,Pro_2,0)-1):INDEX(OFFSET(Pro_2,0,2),MATCH(2,1/(Pro_2=$D$3),1)),ROWS(AB$2:AB52)),\"\")","v":""},{"$f":"IFERROR(INDEX(INDEX(OFFSET(Pro_2,0,3),MATCH($D$3,Pro_2,0)-1):INDEX(OFFSET(Pro_2,0,3),MATCH(2,1/(Pro_2=$D$3),1)),ROWS(AC$2:AC52)),\"\")","v":""},null,null,null,"","",{"$f":"IFERROR(INDEX(INDEX(Pro_3,MATCH($F$3,Pro_3,0)-1):INDEX(Pro_3,MATCH(2,1/(Pro_3=$F$3),1)),ROWS(AI$2:AI52)),\"\")","v":""},{"$f":"IFERROR(INDEX(INDEX(OFFSET(Pro_3,0,1),MATCH($F$3,Pro_3,0)-1):INDEX(OFFSET(Pro_3,0,1),MATCH(2,1/(Pro_3=$F$3),1)),ROWS(AJ$2:AJ52)),\"\")","v":""},{"$f":"IFERROR(INDEX(INDEX(OFFSET(Pro_3,0,2),MATCH($F$3,Pro_3,0)-1):INDEX(OFFSET(Pro_3,0,2),MATCH(2,1/(Pro_3=$F$3),1)),ROWS(AK$2:AK52)),\"\")","v":""},{"$f":"IFERROR(INDEX(INDEX(OFFSET(Pro_3,0,3),MATCH($F$3,Pro_3,0)-1):INDEX(OFFSET(Pro_3,0,3),MATCH(2,1/(Pro_3=$F$3),1)),ROWS(AL$2:AL52)),\"\")","v":""}]
[null,null,null,null,null,null,null,null,null,"",null,null,null,null,"",{"$f":"IFERROR(INDEX(INDEX(Pro_1,MATCH($B$3,Pro_1,0)-1):INDEX(Pro_1,MATCH(2,1/(Pro_1=$B$3),1)),ROWS(P$2:P53)),\"\")","v":""},{"$f":"IFERROR(INDEX(INDEX(OFFSET(Pro_1,0,1),MATCH($B$3,Pro_1,0)-1):INDEX(OFFSET(Pro_1,0,1),MATCH(2,1/(Pro_1=$B$3),1)),ROWS(Q$2:Q53)),\"\")","v":""},{"$f":"IFERROR(INDEX(INDEX(OFFSET(Pro_1,0,2),MATCH($B$3,Pro_1,0)-1):INDEX(OFFSET(Pro_1,0,2),MATCH(2,1/(Pro_1=$B$3),1)),ROWS(R$2:R53)),\"\")","v":""},{"$f":"IFERROR(INDEX(INDEX(OFFSET(Pro_1,0,3),MATCH($B$3,Pro_1,0)-1):INDEX(OFFSET(Pro_1,0,3),MATCH(2,1/(Pro_1=$B$3),1)),ROWS(S$2:S53)),\"\")","v":""},null,null,null,null,"","",{"$f":"IFERROR(INDEX(INDEX(Pro_2,MATCH($D$3,Pro_2,0)-1):INDEX(Pro_2,MATCH(2,1/(Pro_2=$D$3),1)),ROWS(Z$2:Z53)),\"\")","v":""},{"$f":"IFERROR(INDEX(INDEX(OFFSET(Pro_2,0,1),MATCH($D$3,Pro_2,0)-1):INDEX(OFFSET(Pro_2,0,1),MATCH(2,1/(Pro_2=$D$3),1)),ROWS(AA$2:AA53)),\"\")","v":""},{"$f":"IFERROR(INDEX(INDEX(OFFSET(Pro_2,0,2),MATCH($D$3,Pro_2,0)-1):INDEX(OFFSET(Pro_2,0,2),MATCH(2,1/(Pro_2=$D$3),1)),ROWS(AB$2:AB53)),\"\")","v":""},{"$f":"IFERROR(INDEX(INDEX(OFFSET(Pro_2,0,3),MATCH($D$3,Pro_2,0)-1):INDEX(OFFSET(Pro_2,0,3),MATCH(2,1/(Pro_2=$D$3),1)),ROWS(AC$2:AC53)),\"\")","v":""},null,null,null,"","",{"$f":"IFERROR(INDEX(INDEX(Pro_3,MATCH($F$3,Pro_3,0)-1):INDEX(Pro_3,MATCH(2,1/(Pro_3=$F$3),1)),ROWS(AI$2:AI53)),\"\")","v":""},{"$f":"IFERROR(INDEX(INDEX(OFFSET(Pro_3,0,1),MATCH($F$3,Pro_3,0)-1):INDEX(OFFSET(Pro_3,0,1),MATCH(2,1/(Pro_3=$F$3),1)),ROWS(AJ$2:AJ53)),\"\")","v":""},{"$f":"IFERROR(INDEX(INDEX(OFFSET(Pro_3,0,2),MATCH($F$3,Pro_3,0)-1):INDEX(OFFSET(Pro_3,0,2),MATCH(2,1/(Pro_3=$F$3),1)),ROWS(AK$2:AK53)),\"\")","v":""},{"$f":"IFERROR(INDEX(INDEX(OFFSET(Pro_3,0,3),MATCH($F$3,Pro_3,0)-1):INDEX(OFFSET(Pro_3,0,3),MATCH(2,1/(Pro_3=$F$3),1)),ROWS(AL$2:AL53)),\"\")","v":""}]
[null,null,null,null,null,null,null,null,null,"",null,null,null,null,"",{"$f":"IFERROR(INDEX(INDEX(Pro_1,MATCH($B$3,Pro_1,0)-1):INDEX(Pro_1,MATCH(2,1/(Pro_1=$B$3),1)),ROWS(P$2:P54)),\"\")","v":""},{"$f":"IFERROR(INDEX(INDEX(OFFSET(Pro_1,0,1),MATCH($B$3,Pro_1,0)-1):INDEX(OFFSET(Pro_1,0,1),MATCH(2,1/(Pro_1=$B$3),1)),ROWS(Q$2:Q54)),\"\")","v":""},{"$f":"IFERROR(INDEX(INDEX(OFFSET(Pro_1,0,2),MATCH($B$3,Pro_1,0)-1):INDEX(OFFSET(Pro_1,0,2),MATCH(2,1/(Pro_1=$B$3),1)),ROWS(R$2:R54)),\"\")","v":""},{"$f":"IFERROR(INDEX(INDEX(OFFSET(Pro_1,0,3),MATCH($B$3,Pro_1,0)-1):INDEX(OFFSET(Pro_1,0,3),MATCH(2,1/(Pro_1=$B$3),1)),ROWS(S$2:S54)),\"\")","v":""},null,null,null,null,"","",{"$f":"IFERROR(INDEX(INDEX(Pro_2,MATCH($D$3,Pro_2,0)-1):INDEX(Pro_2,MATCH(2,1/(Pro_2=$D$3),1)),ROWS(Z$2:Z54)),\"\")","v":""},{"$f":"IFERROR(INDEX(INDEX(OFFSET(Pro_2,0,1),MATCH($D$3,Pro_2,0)-1):INDEX(OFFSET(Pro_2,0,1),MATCH(2,1/(Pro_2=$D$3),1)),ROWS(AA$2:AA54)),\"\")","v":""},{"$f":"IFERROR(INDEX(INDEX(OFFSET(Pro_2,0,2),MATCH($D$3,Pro_2,0)-1):INDEX(OFFSET(Pro_2,0,2),MATCH(2,1/(Pro_2=$D$3),1)),ROWS(AB$2:AB54)),\"\")","v":""},{"$f":"IFERROR(INDEX(INDEX(OFFSET(Pro_2,0,3),MATCH($D$3,Pro_2,0)-1):INDEX(OFFSET(Pro_2,0,3),MATCH(2,1/(Pro_2=$D$3),1)),ROWS(AC$2:AC54)),\"\")","v":""},null,null,null,"","",{"$f":"IFERROR(INDEX(INDEX(Pro_3,MATCH($F$3,Pro_3,0)-1):INDEX(Pro_3,MATCH(2,1/(Pro_3=$F$3),1)),ROWS(AI$2:AI54)),\"\")","v":""},{"$f":"IFERROR(INDEX(INDEX(OFFSET(Pro_3,0,1),MATCH($F$3,Pro_3,0)-1):INDEX(OFFSET(Pro_3,0,1),MATCH(2,1/(Pro_3=$F$3),1)),ROWS(AJ$2:AJ54)),\"\")","v":""},{"$f":"IFERROR(INDEX(INDEX(OFFSET(Pro_3,0,2),MATCH($F$3,Pro_3,0)-1):INDEX(OFFSET(Pro_3,0,2),MATCH(2,1/(Pro_3=$F$3),1)),ROWS(AK$2:AK54)),\"\")","v":""},{"$f":"IFERROR(INDEX(INDEX(OFFSET(Pro_3,0,3),MATCH($F$3,Pro_3,0)-1):INDEX(OFFSET(Pro_3,0,3),MATCH(2,1/(Pro_3=$F$3),1)),ROWS(AL$2:AL54)),\"\")","v":""}]
[null,null,null,null,null,null,null,null,null,"",null,null,null,null,"",{"$f":"IFERROR(INDEX(INDEX(Pro_1,MATCH($B$3,Pro_1,0)-1):INDEX(Pro_1,MATCH(2,1/(Pro_1=$B$3),1)),ROWS(P$2:P55)),\"\")","v":""},{"$f":"IFERROR(INDEX(INDEX(OFFSET(Pro_1,0,1),MATCH($B$3,Pro_1,0)-1):INDEX(OFFSET(Pro_1,0,1),MATCH(2,1/(Pro_1=$B$3),1)),ROWS(Q$2:Q55)),\"\")","v":""},{"$f":"IFERROR(INDEX(INDEX(OFFSET(Pro_1,0,2),MATCH($B$3,Pro_1,0)-1):INDEX(OFFSET(Pro_1,0,2),MATCH(2,1/(Pro_1=$B$3),1)),ROWS(R$2:R55)),\"\")","v":""},{"$f":"IFERROR(INDEX(INDEX(OFFSET(Pro_1,0,3),MATCH($B$3,Pro_1,0)-1):INDEX(OFFSET(Pro_1,0,3),MATCH(2,1/(Pro_1=$B$3),1)),ROWS(S$2:S55)),\"\")","v":""},null,null,null,null,"","",{"$f":"IFERROR(INDEX(INDEX(Pro_2,MATCH($D$3,Pro_2,0)-1):INDEX(Pro_2,MATCH(2,1/(Pro_2=$D$3),1)),ROWS(Z$2:Z55)),\"\")","v":""},{"$f":"IFERROR(INDEX(INDEX(OFFSET(Pro_2,0,1),MATCH($D$3,Pro_2,0)-1):INDEX(OFFSET(Pro_2,0,1),MATCH(2,1/(Pro_2=$D$3),1)),ROWS(AA$2:AA55)),\"\")","v":""},{"$f":"IFERROR(INDEX(INDEX(OFFSET(Pro_2,0,2),MATCH($D$3,Pro_2,0)-1):INDEX(OFFSET(Pro_2,0,2),MATCH(2,1/(Pro_2=$D$3),1)),ROWS(AB$2:AB55)),\"\")","v":""},{"$f":"IFERROR(INDEX(INDEX(OFFSET(Pro_2,0,3),MATCH($D$3,Pro_2,0)-1):INDEX(OFFSET(Pro_2,0,3),MATCH(2,1/(Pro_2=$D$3),1)),ROWS(AC$2:AC55)),\"\")","v":""},null,null,null,"","",{"$f":"IFERROR(INDEX(INDEX(Pro_3,MATCH($F$3,Pro_3,0)-1):INDEX(Pro_3,MATCH(2,1/(Pro_3=$F$3),1)),ROWS(AI$2:AI55)),\"\")","v":""},{"$f":"IFERROR(INDEX(INDEX(OFFSET(Pro_3,0,1),MATCH($F$3,Pro_3,0)-1):INDEX(OFFSET(Pro_3,0,1),MATCH(2,1/(Pro_3=$F$3),1)),ROWS(AJ$2:AJ55)),\"\")","v":""},{"$f":"IFERROR(INDEX(INDEX(OFFSET(Pro_3,0,2),MATCH($F$3,Pro_3,0)-1):INDEX(OFFSET(Pro_3,0,2),MATCH(2,1/(Pro_3=$F$3),1)),ROWS(AK$2:AK55)),\"\")","v":""},{"$f":"IFERROR(INDEX(INDEX(OFFSET(Pro_3,0,3),MATCH($F$3,Pro_3,0)-1):INDEX(OFFSET(Pro_3,0,3),MATCH(2,1/(Pro_3=$F$3),1)),ROWS(AL$2:AL55)),\"\")","v":""}]
[null,null,null,null,null,null,null,null,null,"",null,null,null,null,"",{"$f":"IFERROR(INDEX(INDEX(Pro_1,MATCH($B$3,Pro_1,0)-1):INDEX(Pro_1,MATCH(2,1/(Pro_1=$B$3),1)),ROWS(P$2:P56)),\"\")","v":""},{"$f":"IFERROR(INDEX(INDEX(OFFSET(Pro_1,0,1),MATCH($B$3,Pro_1,0)-1):INDEX(OFFSET(Pro_1,0,1),MATCH(2,1/(Pro_1=$B$3),1)),ROWS(Q$2:Q56)),\"\")","v":""},{"$f":"IFERROR(INDEX(INDEX(OFFSET(Pro_1,0,2),MATCH($B$3,Pro_1,0)-1):INDEX(OFFSET(Pro_1,0,2),MATCH(2,1/(Pro_1=$B$3),1)),ROWS(R$2:R56)),\"\")","v":""},{"$f":"IFERROR(INDEX(INDEX(OFFSET(Pro_1,0,3),MATCH($B$3,Pro_1,0)-1):INDEX(OFFSET(Pro_1,0,3),MATCH(2,1/(Pro_1=$B$3),1)),ROWS(S$2:S56)),\"\")","v":""},null,null,null,null,"","",{"$f":"IFERROR(INDEX(INDEX(Pro_2,MATCH($D$3,Pro_2,0)-1):INDEX(Pro_2,MATCH(2,1/(Pro_2=$D$3),1)),ROWS(Z$2:Z56)),\"\")","v":""},{"$f":"IFERROR(INDEX(INDEX(OFFSET(Pro_2,0,1),MATCH($D$3,Pro_2,0)-1):INDEX(OFFSET(Pro_2,0,1),MATCH(2,1/(Pro_2=$D$3),1)),ROWS(AA$2:AA56)),\"\")","v":""},{"$f":"IFERROR(INDEX(INDEX(OFFSET(Pro_2,0,2),MATCH($D$3,Pro_2,0)-1):INDEX(OFFSET(Pro_2,0,2),MATCH(2,1/(Pro_2=$D$3),1)),ROWS(AB$2:AB56)),\"\")","v":""},{"$f":"IFERROR(INDEX(INDEX(OFFSET(Pro_2,0,3),MATCH($D$3,Pro_2,0)-1):INDEX(OFFSET(Pro_2,0,3),MATCH(2,1/(Pro_2=$D$3),1)),ROWS(AC$2:AC56)),\"\")","v":""},null,null,null,"","",{"$f":"IFERROR(INDEX(INDEX(Pro_3,MATCH($F$3,Pro_3,0)-1):INDEX(Pro_3,MATCH(2,1/(Pro_3=$F$3),1)),ROWS(AI$2:AI56)),\"\")","v":""},{"$f":"IFERROR(INDEX(INDEX(OFFSET(Pro_3,0,1),MATCH($F$3,Pro_3,0)-1):INDEX(OFFSET(Pro_3,0,1),MATCH(2,1/(Pro_3=$F$3),1)),ROWS(AJ$2:AJ56)),\"\")","v":""},{"$f":"IFERROR(INDEX(INDEX(OFFSET(Pro_3,0,2),MATCH($F$3,Pro_3,0)-1):INDEX(OFFSET(Pro_3,0,2),MATCH(2,1/(Pro_3=$F$3),1)),ROWS(AK$2:AK56)),\"\")","v":""},{"$f":"IFERROR(INDEX(INDEX(OFFSET(Pro_3,0,3),MATCH($F$3,Pro_3,0)-1):INDEX(OFFSET(Pro_3,0,3),MATCH(2,1/(Pro_3=$F$3),1)),ROWS(AL$2:AL56)),\"\")","v":""}]
[null,null,null,null,null,null,null,null,null,"",null,null,null,null,"",{"$f":"IFERROR(INDEX(INDEX(Pro_1,MATCH($B$3,Pro_1,0)-1):INDEX(Pro_1,MATCH(2,1/(Pro_1=$B$3),1)),ROWS(P$2:P57)),\"\")","v":""},{"$f":"IFERROR(INDEX(INDEX(OFFSET(Pro_1,0,1),MATCH($B$3,Pro_1,0)-1):INDEX(OFFSET(Pro_1,0,1),MATCH(2,1/(Pro_1=$B$3),1)),ROWS(Q$2:Q57)),\"\")","v":""},{"$f":"IFERROR(INDEX(INDEX(OFFSET(Pro_1,0,2),MATCH($B$3,Pro_1,0)-1):INDEX(OFFSET(Pro_1,0,2),MATCH(2,1/(Pro_1=$B$3),1)),ROWS(R$2:R57)),\"\")","v":""},{"$f":"IFERROR(INDEX(INDEX(OFFSET(Pro_1,0,3),MATCH($B$3,Pro_1,0)-1):INDEX(OFFSET(Pro_1,0,3),MATCH(2,1/(Pro_1=$B$3),1)),ROWS(S$2:S57)),\"\")","v":""},null,null,null,null,"","",{"$f":"IFERROR(INDEX(INDEX(Pro_2,MATCH($D$3,Pro_2,0)-1):INDEX(Pro_2,MATCH(2,1/(Pro_2=$D$3),1)),ROWS(Z$2:Z57)),\"\")","v":""},{"$f":"IFERROR(INDEX(INDEX(OFFSET(Pro_2,0,1),MATCH($D$3,Pro_2,0)-1):INDEX(OFFSET(Pro_2,0,1),MATCH(2,1/(Pro_2=$D$3),1)),ROWS(AA$2:AA57)),\"\")","v":""},{"$f":"IFERROR(INDEX(INDEX(OFFSET(Pro_2,0,2),MATCH($D$3,Pro_2,0)-1):INDEX(OFFSET(Pro_2,0,2),MATCH(2,1/(Pro_2=$D$3),1)),ROWS(AB$2:AB57)),\"\")","v":""},{"$f":"IFERROR(INDEX(INDEX(OFFSET(Pro_2,0,3),MATCH($D$3,Pro_2,0)-1):INDEX(OFFSET(Pro_2,0,3),MATCH(2,1/(Pro_2=$D$3),1)),ROWS(AC$2:AC57)),\"\")","v":""},null,null,null,"","",{"$f":"IFERROR(INDEX(INDEX(Pro_3,MATCH($F$3,Pro_3,0)-1):INDEX(Pro_3,MATCH(2,1/(Pro_3=$F$3),1)),ROWS(AI$2:AI57)),\"\")","v":""},{"$f":"IFERROR(INDEX(INDEX(OFFSET(Pro_3,0,1),MATCH($F$3,Pro_3,0)-1):INDEX(OFFSET(Pro_3,0,1),MATCH(2,1/(Pro_3=$F$3),1)),ROWS(AJ$2:AJ57)),\"\")","v":""},{"$f":"IFERROR(INDEX(INDEX(OFFSET(Pro_3,0,2),MATCH($F$3,Pro_3,0)-1):INDEX(OFFSET(Pro_3,0,2),MATCH(2,1/(Pro_3=$F$3),1)),ROWS(AK$2:AK57)),\"\")","v":""},{"$f":"IFERROR(INDEX(INDEX(OFFSET(Pro_3,0,3),MATCH($F$3,Pro_3,0)-1):INDEX(OFFSET(Pro_3,0,3),MATCH(2,1/(Pro_3=$F$3),1)),ROWS(AL$2:AL57)),\"\")","v":""}]
[null,null,null,null,null,null,null,null,null,"",null,null,null,null,"",{"$f":"IFERROR(INDEX(INDEX(Pro_1,MATCH($B$3,Pro_1,0)-1):INDEX(Pro_1,MATCH(2,1/(Pro_1=$B$3),1)),ROWS(P$2:P58)),\"\")","v":""},{"$f":"IFERROR(INDEX(INDEX(OFFSET(Pro_1,0,1),MATCH($B$3,Pro_1,0)-1):INDEX(OFFSET(Pro_1,0,1),MATCH(2,1/(Pro_1=$B$3),1)),ROWS(Q$2:Q58)),\"\")","v":""},{"$f":"IFERROR(INDEX(INDEX(OFFSET(Pro_1,0,2),MATCH($B$3,Pro_1,0)-1):INDEX(OFFSET(Pro_1,0,2),MATCH(2,1/(Pro_1=$B$3),1)),ROWS(R$2:R58)),\"\")","v":""},{"$f":"IFERROR(INDEX(INDEX(OFFSET(Pro_1,0,3),MATCH($B$3,Pro_1,0)-1):INDEX(OFFSET(Pro_1,0,3),MATCH(2,1/(Pro_1=$B$3),1)),ROWS(S$2:S58)),\"\")","v":""},null,null,null,null,"","",{"$f":"IFERROR(INDEX(INDEX(Pro_2,MATCH($D$3,Pro_2,0)-1):INDEX(Pro_2,MATCH(2,1/(Pro_2=$D$3),1)),ROWS(Z$2:Z58)),\"\")","v":""},{"$f":"IFERROR(INDEX(INDEX(OFFSET(Pro_2,0,1),MATCH($D$3,Pro_2,0)-1):INDEX(OFFSET(Pro_2,0,1),MATCH(2,1/(Pro_2=$D$3),1)),ROWS(AA$2:AA58)),\"\")","v":""},{"$f":"IFERROR(INDEX(INDEX(OFFSET(Pro_2,0,2),MATCH($D$3,Pro_2,0)-1):INDEX(OFFSET(Pro_2,0,2),MATCH(2,1/(Pro_2=$D$3),1)),ROWS(AB$2:AB58)),\"\")","v":""},{"$f":"IFERROR(INDEX(INDEX(OFFSET(Pro_2,0,3),MATCH($D$3,Pro_2,0)-1):INDEX(OFFSET(Pro_2,0,3),MATCH(2,1/(Pro_2=$D$3),1)),ROWS(AC$2:AC58)),\"\")","v":""},null,null,null,"","",{"$f":"IFERROR(INDEX(INDEX(Pro_3,MATCH($F$3,Pro_3,0)-1):INDEX(Pro_3,MATCH(2,1/(Pro_3=$F$3),1)),ROWS(AI$2:AI58)),\"\")","v":""},{"$f":"IFERROR(INDEX(INDEX(OFFSET(Pro_3,0,1),MATCH($F$3,Pro_3,0)-1):INDEX(OFFSET(Pro_3,0,1),MATCH(2,1/(Pro_3=$F$3),1)),ROWS(AJ$2:AJ58)),\"\")","v":""},{"$f":"IFERROR(INDEX(INDEX(OFFSET(Pro_3,0,2),MATCH($F$3,Pro_3,0)-1):INDEX(OFFSET(Pro_3,0,2),MATCH(2,1/(Pro_3=$F$3),1)),ROWS(AK$2:AK58)),\"\")","v":""},{"$f":"IFERROR(INDEX(INDEX(OFFSET(Pro_3,0,3),MATCH($F$3,Pro_3,0)-1):INDEX(OFFSET(Pro_3,0,3),MATCH(2,1/(Pro_3=$F$3),1)),ROWS(AL$2:AL58)),\"\")","v":""}]
[null,null,null,null,null,null,null,null,null,"",null,null,null,null,"",{"$f":"IFERROR(INDEX(INDEX(Pro_1,MATCH($B$3,Pro_1,0)-1):INDEX(Pro_1,MATCH(2,1/(Pro_1=$B$3),1)),ROWS(P$2:P59)),\"\")","v":""},{"$f":"IFERROR(INDEX(INDEX(OFFSET(Pro_1,0,1),MATCH($B$3,Pro_1,0)-1):INDEX(OFFSET(Pro_1,0,1),MATCH(2,1/(Pro_1=$B$3),1)),ROWS(Q$2:Q59)),\"\")","v":""},{"$f":"IFERROR(INDEX(INDEX(OFFSET(Pro_1,0,2),MATCH($B$3,Pro_1,0)-1):INDEX(OFFSET(Pro_1,0,2),MATCH(2,1/(Pro_1=$B$3),1)),ROWS(R$2:R59)),\"\")","v":""},{"$f":"IFERROR(INDEX(INDEX(OFFSET(Pro_1,0,3),MATCH($B$3,Pro_1,0)-1):INDEX(OFFSET(Pro_1,0,3),MATCH(2,1/(Pro_1=$B$3),1)),ROWS(S$2:S59)),\"\")","v":""},null,null,null,null,"","",{"$f":"IFERROR(INDEX(INDEX(Pro_2,MATCH($D$3,Pro_2,0)-1):INDEX(Pro_2,MATCH(2,1/(Pro_2=$D$3),1)),ROWS(Z$2:Z59)),\"\")","v":""},{"$f":"IFERROR(INDEX(INDEX(OFFSET(Pro_2,0,1),MATCH($D$3,Pro_2,0)-1):INDEX(OFFSET(Pro_2,0,1),MATCH(2,1/(Pro_2=$D$3),1)),ROWS(AA$2:AA59)),\"\")","v":""},{"$f":"IFERROR(INDEX(INDEX(OFFSET(Pro_2,0,2),MATCH($D$3,Pro_2,0)-1):INDEX(OFFSET(Pro_2,0,2),MATCH(2,1/(Pro_2=$D$3),1)),ROWS(AB$2:AB59)),\"\")","v":""},{"$f":"IFERROR(INDEX(INDEX(OFFSET(Pro_2,0,3),MATCH($D$3,Pro_2,0)-1):INDEX(OFFSET(Pro_2,0,3),MATCH(2,1/(Pro_2=$D$3),1)),ROWS(AC$2:AC59)),\"\")","v":""},null,null,null,"","",{"$f":"IFERROR(INDEX(INDEX(Pro_3,MATCH($F$3,Pro_3,0)-1):INDEX(Pro_3,MATCH(2,1/(Pro_3=$F$3),1)),ROWS(AI$2:AI59)),\"\")","v":""},{"$f":"IFERROR(INDEX(INDEX(OFFSET(Pro_3,0,1),MATCH($F$3,Pro_3,0)-1):INDEX(OFFSET(Pro_3,0,1),MATCH(2,1/(Pro_3=$F$3),1)),ROWS(AJ$2:AJ59)),\"\")","v":""},{"$f":"IFERROR(INDEX(INDEX(OFFSET(Pro_3,0,2),MATCH($F$3,Pro_3,0)-1):INDEX(OFFSET(Pro_3,0,2),MATCH(2,1/(Pro_3=$F$3),1)),ROWS(AK$2:AK59)),\"\")","v":""},{"$f":"IFERROR(INDEX(INDEX(OFFSET(Pro_3,0,3),MATCH($F$3,Pro_3,0)-1):INDEX(OFFSET(Pro_3,0,3),MATCH(2,1/(Pro_3=$F$3),1)),ROWS(AL$2:AL59)),\"\")","v":""}]
[null,null,null,null,null,null,null,null,null,"",null,null,null,null,"",{"$f":"IFERROR(INDEX(INDEX(Pro_1,MATCH($B$3,Pro_1,0)-1):INDEX(Pro_1,MATCH(2,1/(Pro_1=$B$3),1)),ROWS(P$2:P60)),\"\")","v":""},{"$f":"IFERROR(INDEX(INDEX(OFFSET(Pro_1,0,1),MATCH($B$3,Pro_1,0)-1):INDEX(OFFSET(Pro_1,0,1),MATCH(2,1/(Pro_1=$B$3),1)),ROWS(Q$2:Q60)),\"\")","v":""},{"$f":"IFERROR(INDEX(INDEX(OFFSET(Pro_1,0,2),MATCH($B$3,Pro_1,0)-1):INDEX(OFFSET(Pro_1,0,2),MATCH(2,1/(Pro_1=$B$3),1)),ROWS(R$2:R60)),\"\")","v":""},{"$f":"IFERROR(INDEX(INDEX(OFFSET(Pro_1,0,3),MATCH($B$3,Pro_1,0)-1):INDEX(OFFSET(Pro_1,0,3),MATCH(2,1/(Pro_1=$B$3),1)),ROWS(S$2:S60)),\"\")","v":""},null,null,null,null,"","",{"$f":"IFERROR(INDEX(INDEX(Pro_2,MATCH($D$3,Pro_2,0)-1):INDEX(Pro_2,MATCH(2,1/(Pro_2=$D$3),1)),ROWS(Z$2:Z60)),\"\")","v":""},{"$f":"IFERROR(INDEX(INDEX(OFFSET(Pro_2,0,1),MATCH($D$3,Pro_2,0)-1):INDEX(OFFSET(Pro_2,0,1),MATCH(2,1/(Pro_2=$D$3),1)),ROWS(AA$2:AA60)),\"\")","v":""},{"$f":"IFERROR(INDEX(INDEX(OFFSET(Pro_2,0,2),MATCH($D$3,Pro_2,0)-1):INDEX(OFFSET(Pro_2,0,2),MATCH(2,1/(Pro_2=$D$3),1)),ROWS(AB$2:AB60)),\"\")","v":""},{"$f":"IFERROR(INDEX(INDEX(OFFSET(Pro_2,0,3),MATCH($D$3,Pro_2,0)-1):INDEX(OFFSET(Pro_2,0,3),MATCH(2,1/(Pro_2=$D$3),1)),ROWS(AC$2:AC60)),\"\")","v":""},null,null,null,"","",{"$f":"IFERROR(INDEX(INDEX(Pro_3,MATCH($F$3,Pro_3,0)-1):INDEX(Pro_3,MATCH(2,1/(Pro_3=$F$3),1)),ROWS(AI$2:AI60)),\"\")","v":""},{"$f":"IFERROR(INDEX(INDEX(OFFSET(Pro_3,0,1),MATCH($F$3,Pro_3,0)-1):INDEX(OFFSET(Pro_3,0,1),MATCH(2,1/(Pro_3=$F$3),1)),ROWS(AJ$2:AJ60)),\"\")","v":""},{"$f":"IFERROR(INDEX(INDEX(OFFSET(Pro_3,0,2),MATCH($F$3,Pro_3,0)-1):INDEX(OFFSET(Pro_3,0,2),MATCH(2,1/(Pro_3=$F$3),1)),ROWS(AK$2:AK60)),\"\")","v":""},{"$f":"IFERROR(INDEX(INDEX(OFFSET(Pro_3,0,3),MATCH($F$3,Pro_3,0)-1):INDEX(OFFSET(Pro_3,0,3),MATCH(2,1/(Pro_3=$F$3),1)),ROWS(AL$2:AL60)),\"\")","v":""}]
[null,null,null,null,null,null,null,null,null,"",null,null,null,null,"",{"$f":"IFERROR(INDEX(INDEX(Pro_1,MATCH($B$3,Pro_1,0)-1):INDEX(Pro_1,MATCH(2,1/(Pro_1=$B$3),1)),ROWS(P$2:P61)),\"\")","v":""},{"$f":"IFERROR(INDEX(INDEX(OFFSET(Pro_1,0,1),MATCH($B$3,Pro_1,0)-1):INDEX(OFFSET(Pro_1,0,1),MATCH(2,1/(Pro_1=$B$3),1)),ROWS(Q$2:Q61)),\"\")","v":""},{"$f":"IFERROR(INDEX(INDEX(OFFSET(Pro_1,0,2),MATCH($B$3,Pro_1,0)-1):INDEX(OFFSET(Pro_1,0,2),MATCH(2,1/(Pro_1=$B$3),1)),ROWS(R$2:R61)),\"\")","v":""},{"$f":"IFERROR(INDEX(INDEX(OFFSET(Pro_1,0,3),MATCH($B$3,Pro_1,0)-1):INDEX(OFFSET(Pro_1,0,3),MATCH(2,1/(Pro_1=$B$3),1)),ROWS(S$2:S61)),\"\")","v":""},null,null,null,null,"","",{"$f":"IFERROR(INDEX(INDEX(Pro_2,MATCH($D$3,Pro_2,0)-1):INDEX(Pro_2,MATCH(2,1/(Pro_2=$D$3),1)),ROWS(Z$2:Z61)),\"\")","v":""},{"$f":"IFERROR(INDEX(INDEX(OFFSET(Pro_2,0,1),MATCH($D$3,Pro_2,0)-1):INDEX(OFFSET(Pro_2,0,1),MATCH(2,1/(Pro_2=$D$3),1)),ROWS(AA$2:AA61)),\"\")","v":""},{"$f":"IFERROR(INDEX(INDEX(OFFSET(Pro_2,0,2),MATCH($D$3,Pro_2,0)-1):INDEX(OFFSET(Pro_2,0,2),MATCH(2,1/(Pro_2=$D$3),1)),ROWS(AB$2:AB61)),\"\")","v":""},{"$f":"IFERROR(INDEX(INDEX(OFFSET(Pro_2,0,3),MATCH($D$3,Pro_2,0)-1):INDEX(OFFSET(Pro_2,0,3),MATCH(2,1/(Pro_2=$D$3),1)),ROWS(AC$2:AC61)),\"\")","v":""},null,null,null,"","",{"$f":"IFERROR(INDEX(INDEX(Pro_3,MATCH($F$3,Pro_3,0)-1):INDEX(Pro_3,MATCH(2,1/(Pro_3=$F$3),1)),ROWS(AI$2:AI61)),\"\")","v":""},{"$f":"IFERROR(INDEX(INDEX(OFFSET(Pro_3,0,1),MATCH($F$3,Pro_3,0)-1):INDEX(OFFSET(Pro_3,0,1),MATCH(2,1/(Pro_3=$F$3),1)),ROWS(AJ$2:AJ61)),\"\")","v":""},{"$f":"IFERROR(INDEX(INDEX(OFFSET(Pro_3,0,2),MATCH($F$3,Pro_3,0)-1):INDEX(OFFSET(Pro_3,0,2),MATCH(2,1/(Pro_3=$F$3),1)),ROWS(AK$2:AK61)),\"\")","v":""},{"$f":"IFERROR(INDEX(INDEX(OFFSET(Pro_3,0,3),MATCH($F$3,Pro_3,0)-1):INDEX(OFFSET(Pro_3,0,3),MATCH(2,1/(Pro_3=$F$3),1)),ROWS(AL$2:AL61)),\"\")","v":""}]
[null,null,null,null,null,null,null,null,null,"",null,null,null,null,"",{"$f":"IFERROR(INDEX(INDEX(Pro_1,MATCH($B$3,Pro_1,0)-1):INDEX(Pro_1,MATCH(2,1/(Pro_1=$B$3),1)),ROWS(P$2:P62)),\"\")","v":""},{"$f":"IFERROR(INDEX(INDEX(OFFSET(Pro_1,0,1),MATCH($B$3,Pro_1,0)-1):INDEX(OFFSET(Pro_1,0,1),MATCH(2,1/(Pro_1=$B$3),1)),ROWS(Q$2:Q62)),\"\")","v":""},{"$f":"IFERROR(INDEX(INDEX(OFFSET(Pro_1,0,2),MATCH($B$3,Pro_1,0)-1):INDEX(OFFSET(Pro_1,0,2),MATCH(2,1/(Pro_1=$B$3),1)),ROWS(R$2:R62)),\"\")","v":""},{"$f":"IFERROR(INDEX(INDEX(OFFSET(Pro_1,0,3),MATCH($B$3,Pro_1,0)-1):INDEX(OFFSET(Pro_1,0,3),MATCH(2,1/(Pro_1=$B$3),1)),ROWS(S$2:S62)),\"\")","v":""},null,null,null,null,"","",{"$f":"IFERROR(INDEX(INDEX(Pro_2,MATCH($D$3,Pro_2,0)-1):INDEX(Pro_2,MATCH(2,1/(Pro_2=$D$3),1)),ROWS(Z$2:Z62)),\"\")","v":""},{"$f":"IFERROR(INDEX(INDEX(OFFSET(Pro_2,0,1),MATCH($D$3,Pro_2,0)-1):INDEX(OFFSET(Pro_2,0,1),MATCH(2,1/(Pro_2=$D$3),1)),ROWS(AA$2:AA62)),\"\")","v":""},{"$f":"IFERROR(INDEX(INDEX(OFFSET(Pro_2,0,2),MATCH($D$3,Pro_2,0)-1):INDEX(OFFSET(Pro_2,0,2),MATCH(2,1/(Pro_2=$D$3),1)),ROWS(AB$2:AB62)),\"\")","v":""},{"$f":"IFERROR(INDEX(INDEX(OFFSET(Pro_2,0,3),MATCH($D$3,Pro_2,0)-1):INDEX(OFFSET(Pro_2,0,3),MATCH(2,1/(Pro_2=$D$3),1)),ROWS(AC$2:AC62)),\"\")","v":""},null,null,null,"","",{"$f":"IFERROR(INDEX(INDEX(Pro_3,MATCH($F$3,Pro_3,0)-1):INDEX(Pro_3,MATCH(2,1/(Pro_3=$F$3),1)),ROWS(AI$2:AI62)),\"\")","v":""},{"$f":"IFERROR(INDEX(INDEX(OFFSET(Pro_3,0,1),MATCH($F$3,Pro_3,0)-1):INDEX(OFFSET(Pro_3,0,1),MATCH(2,1/(Pro_3=$F$3),1)),ROWS(AJ$2:AJ62)),\"\")","v":""},{"$f":"IFERROR(INDEX(INDEX(OFFSET(Pro_3,0,2),MATCH($F$3,Pro_3,0)-1):INDEX(OFFSET(Pro_3,0,2),MATCH(2,1/(Pro_3=$F$3),1)),ROWS(AK$2:AK62)),\"\")","v":""},{"$f":"IFERROR(INDEX(INDEX(OFFSET(Pro_3,0,3),MATCH($F$3,Pro_3,0)-1):INDEX(OFFSET(Pro_3,0,3),MATCH(2,1/(Pro_3=$F$3),1)),ROWS(AL$2:AL62)),\"\")","v":""}]
[null,null,null,null,null,null,null,null,null,"",null,null,null,null,"",{"$f":"IFERROR(INDEX(INDEX(Pro_1,MATCH($B$3,Pro_1,0)-1):INDEX(Pro_1,MATCH(2,1/(Pro_1=$B$3),1)),ROWS(P$2:P63)),\"\")","v":""},{"$f":"IFERROR(INDEX(INDEX(OFFSET(Pro_1,0,1),MATCH($B$3,Pro_1,0)-1):INDEX(OFFSET(Pro_1,0,1),MATCH(2,1/(Pro_1=$B$3),1)),ROWS(Q$2:Q63)),\"\")","v":""},{"$f":"IFERROR(INDEX(INDEX(OFFSET(Pro_1,0,2),MATCH($B$3,Pro_1,0)-1):INDEX(OFFSET(Pro_1,0,2),MATCH(2,1/(Pro_1=$B$3),1)),ROWS(R$2:R63)),\"\")","v":""},{"$f":"IFERROR(INDEX(INDEX(OFFSET(Pro_1,0,3),MATCH($B$3,Pro_1,0)-1):INDEX(OFFSET(Pro_1,0,3),MATCH(2,1/(Pro_1=$B$3),1)),ROWS(S$2:S63)),\"\")","v":""},null,null,null,null,"","",{"$f":"IFERROR(INDEX(INDEX(Pro_2,MATCH($D$3,Pro_2,0)-1):INDEX(Pro_2,MATCH(2,1/(Pro_2=$D$3),1)),ROWS(Z$2:Z63)),\"\")","v":""},{"$f":"IFERROR(INDEX(INDEX(OFFSET(Pro_2,0,1),MATCH($D$3,Pro_2,0)-1):INDEX(OFFSET(Pro_2,0,1),MATCH(2,1/(Pro_2=$D$3),1)),ROWS(AA$2:AA63)),\"\")","v":""},{"$f":"IFERROR(INDEX(INDEX(OFFSET(Pro_2,0,2),MATCH($D$3,Pro_2,0)-1):INDEX(OFFSET(Pro_2,0,2),MATCH(2,1/(Pro_2=$D$3),1)),ROWS(AB$2:AB63)),\"\")","v":""},{"$f":"IFERROR(INDEX(INDEX(OFFSET(Pro_2,0,3),MATCH($D$3,Pro_2,0)-1):INDEX(OFFSET(Pro_2,0,3),MATCH(2,1/(Pro_2=$D$3),1)),ROWS(AC$2:AC63)),\"\")","v":""},null,null,null,"","",{"$f":"IFERROR(INDEX(INDEX(Pro_3,MATCH($F$3,Pro_3,0)-1):INDEX(Pro_3,MATCH(2,1/(Pro_3=$F$3),1)),ROWS(AI$2:AI63)),\"\")","v":""},{"$f":"IFERROR(INDEX(INDEX(OFFSET(Pro_3,0,1),MATCH($F$3,Pro_3,0)-1):INDEX(OFFSET(Pro_3,0,1),MATCH(2,1/(Pro_3=$F$3),1)),ROWS(AJ$2:AJ63)),\"\")","v":""},{"$f":"IFERROR(INDEX(INDEX(OFFSET(Pro_3,0,2),MATCH($F$3,Pro_3,0)-1):INDEX(OFFSET(Pro_3,0,2),MATCH(2,1/(Pro_3=$F$3),1)),ROWS(AK$2:AK63)),\"\")","v":""},{"$f":"IFERROR(INDEX(INDEX(OFFSET(Pro_3,0,3),MATCH($F$3,Pro_3,0)-1):INDEX(OFFSET(Pro_3,0,3),MATCH(2,1/(Pro_3=$F$3),1)),ROWS(AL$2:AL63)),\"\")","v":""}]
[null,null,null,null,null,null,null,null,null,"",null,null,null,null,"",{"$f":"IFERROR(INDEX(INDEX(Pro_1,MATCH($B$3,Pro_1,0)-1):INDEX(Pro_1,MATCH(2,1/(Pro_1=$B$3),1)),ROWS(P$2:P64)),\"\")","v":""},{"$f":"IFERROR(INDEX(INDEX(OFFSET(Pro_1,0,1),MATCH($B$3,Pro_1,0)-1):INDEX(OFFSET(Pro_1,0,1),MATCH(2,1/(Pro_1=$B$3),1)),ROWS(Q$2:Q64)),\"\")","v":""},{"$f":"IFERROR(INDEX(INDEX(OFFSET(Pro_1,0,2),MATCH($B$3,Pro_1,0)-1):INDEX(OFFSET(Pro_1,0,2),MATCH(2,1/(Pro_1=$B$3),1)),ROWS(R$2:R64)),\"\")","v":""},{"$f":"IFERROR(INDEX(INDEX(OFFSET(Pro_1,0,3),MATCH($B$3,Pro_1,0)-1):INDEX(OFFSET(Pro_1,0,3),MATCH(2,1/(Pro_1=$B$3),1)),ROWS(S$2:S64)),\"\")","v":""},null,null,null,null,"","",{"$f":"IFERROR(INDEX(INDEX(Pro_2,MATCH($D$3,Pro_2,0)-1):INDEX(Pro_2,MATCH(2,1/(Pro_2=$D$3),1)),ROWS(Z$2:Z64)),\"\")","v":""},{"$f":"IFERROR(INDEX(INDEX(OFFSET(Pro_2,0,1),MATCH($D$3,Pro_2,0)-1):INDEX(OFFSET(Pro_2,0,1),MATCH(2,1/(Pro_2=$D$3),1)),ROWS(AA$2:AA64)),\"\")","v":""},{"$f":"IFERROR(INDEX(INDEX(OFFSET(Pro_2,0,2),MATCH($D$3,Pro_2,0)-1):INDEX(OFFSET(Pro_2,0,2),MATCH(2,1/(Pro_2=$D$3),1)),ROWS(AB$2:AB64)),\"\")","v":""},{"$f":"IFERROR(INDEX(INDEX(OFFSET(Pro_2,0,3),MATCH($D$3,Pro_2,0)-1):INDEX(OFFSET(Pro_2,0,3),MATCH(2,1/(Pro_2=$D$3),1)),ROWS(AC$2:AC64)),\"\")","v":""},null,null,null,"","",{"$f":"IFERROR(INDEX(INDEX(Pro_3,MATCH($F$3,Pro_3,0)-1):INDEX(Pro_3,MATCH(2,1/(Pro_3=$F$3),1)),ROWS(AI$2:AI64)),\"\")","v":""},{"$f":"IFERROR(INDEX(INDEX(OFFSET(Pro_3,0,1),MATCH($F$3,Pro_3,0)-1):INDEX(OFFSET(Pro_3,0,1),MATCH(2,1/(Pro_3=$F$3),1)),ROWS(AJ$2:AJ64)),\"\")","v":""},{"$f":"IFERROR(INDEX(INDEX(OFFSET(Pro_3,0,2),MATCH($F$3,Pro_3,0)-1):INDEX(OFFSET(Pro_3,0,2),MATCH(2,1/(Pro_3=$F$3),1)),ROWS(AK$2:AK64)),\"\")","v":""},{"$f":"IFERROR(INDEX(INDEX(OFFSET(Pro_3,0,3),MATCH($F$3,Pro_3,0)-1):INDEX(OFFSET(Pro_3,0,3),MATCH(2,1/(Pro_3=$F$3),1)),ROWS(AL$2:AL64)),\"\")","v":""}]
[null,null,null,null,null,null,null,null,null,"",null,null,null,null,"",{"$f":"IFERROR(INDEX(INDEX(Pro_1,MATCH($B$3,Pro_1,0)-1):INDEX(Pro_1,MATCH(2,1/(Pro_1=$B$3),1)),ROWS(P$2:P65)),\"\")","v":""},{"$f":"IFERROR(INDEX(INDEX(OFFSET(Pro_1,0,1),MATCH($B$3,Pro_1,0)-1):INDEX(OFFSET(Pro_1,0,1),MATCH(2,1/(Pro_1=$B$3),1)),ROWS(Q$2:Q65)),\"\")","v":""},{"$f":"IFERROR(INDEX(INDEX(OFFSET(Pro_1,0,2),MATCH($B$3,Pro_1,0)-1):INDEX(OFFSET(Pro_1,0,2),MATCH(2,1/(Pro_1=$B$3),1)),ROWS(R$2:R65)),\"\")","v":""},{"$f":"IFERROR(INDEX(INDEX(OFFSET(Pro_1,0,3),MATCH($B$3,Pro_1,0)-1):INDEX(OFFSET(Pro_1,0,3),MATCH(2,1/(Pro_1=$B$3),1)),ROWS(S$2:S65)),\"\")","v":""},null,null,null,null,"","",{"$f":"IFERROR(INDEX(INDEX(Pro_2,MATCH($D$3,Pro_2,0)-1):INDEX(Pro_2,MATCH(2,1/(Pro_2=$D$3),1)),ROWS(Z$2:Z65)),\"\")","v":""},{"$f":"IFERROR(INDEX(INDEX(OFFSET(Pro_2,0,1),MATCH($D$3,Pro_2,0)-1):INDEX(OFFSET(Pro_2,0,1),MATCH(2,1/(Pro_2=$D$3),1)),ROWS(AA$2:AA65)),\"\")","v":""},{"$f":"IFERROR(INDEX(INDEX(OFFSET(Pro_2,0,2),MATCH($D$3,Pro_2,0)-1):INDEX(OFFSET(Pro_2,0,2),MATCH(2,1/(Pro_2=$D$3),1)),ROWS(AB$2:AB65)),\"\")","v":""},{"$f":"IFERROR(INDEX(INDEX(OFFSET(Pro_2,0,3),MATCH($D$3,Pro_2,0)-1):INDEX(OFFSET(Pro_2,0,3),MATCH(2,1/(Pro_2=$D$3),1)),ROWS(AC$2:AC65)),\"\")","v":""},null,null,null,"","",{"$f":"IFERROR(INDEX(INDEX(Pro_3,MATCH($F$3,Pro_3,0)-1):INDEX(Pro_3,MATCH(2,1/(Pro_3=$F$3),1)),ROWS(AI$2:AI65)),\"\")","v":""},{"$f":"IFERROR(INDEX(INDEX(OFFSET(Pro_3,0,1),MATCH($F$3,Pro_3,0)-1):INDEX(OFFSET(Pro_3,0,1),MATCH(2,1/(Pro_3=$F$3),1)),ROWS(AJ$2:AJ65)),\"\")","v":""},{"$f":"IFERROR(INDEX(INDEX(OFFSET(Pro_3,0,2),MATCH($F$3,Pro_3,0)-1):INDEX(OFFSET(Pro_3,0,2),MATCH(2,1/(Pro_3=$F$3),1)),ROWS(AK$2:AK65)),\"\")","v":""},{"$f":"IFERROR(INDEX(INDEX(OFFSET(Pro_3,0,3),MATCH($F$3,Pro_3,0)-1):INDEX(OFFSET(Pro_3,0,3),MATCH(2,1/(Pro_3=$F$3),1)),ROWS(AL$2:AL65)),\"\")","v":""}]
[null,null,null,null,null,null,null,null,null,"",null,null,null,null,"",{"$f":"IFERROR(INDEX(INDEX(Pro_1,MATCH($B$3,Pro_1,0)-1):INDEX(Pro_1,MATCH(2,1/(Pro_1=$B$3),1)),ROWS(P$2:P66)),\"\")","v":""},{"$f":"IFERROR(INDEX(INDEX(OFFSET(Pro_1,0,1),MATCH($B$3,Pro_1,0)-1):INDEX(OFFSET(Pro_1,0,1),MATCH(2,1/(Pro_1=$B$3),1)),ROWS(Q$2:Q66)),\"\")","v":""},{"$f":"IFERROR(INDEX(INDEX(OFFSET(Pro_1,0,2),MATCH($B$3,Pro_1,0)-1):INDEX(OFFSET(Pro_1,0,2),MATCH(2,1/(Pro_1=$B$3),1)),ROWS(R$2:R66)),\"\")","v":""},{"$f":"IFERROR(INDEX(INDEX(OFFSET(Pro_1,0,3),MATCH($B$3,Pro_1,0)-1):INDEX(OFFSET(Pro_1,0,3),MATCH(2,1/(Pro_1=$B$3),1)),ROWS(S$2:S66)),\"\")","v":""},null,null,null,null,"","",{"$f":"IFERROR(INDEX(INDEX(Pro_2,MATCH($D$3,Pro_2,0)-1):INDEX(Pro_2,MATCH(2,1/(Pro_2=$D$3),1)),ROWS(Z$2:Z66)),\"\")","v":""},{"$f":"IFERROR(INDEX(INDEX(OFFSET(Pro_2,0,1),MATCH($D$3,Pro_2,0)-1):INDEX(OFFSET(Pro_2,0,1),MATCH(2,1/(Pro_2=$D$3),1)),ROWS(AA$2:AA66)),\"\")","v":""},{"$f":"IFERROR(INDEX(INDEX(OFFSET(Pro_2,0,2),MATCH($D$3,Pro_2,0)-1):INDEX(OFFSET(Pro_2,0,2),MATCH(2,1/(Pro_2=$D$3),1)),ROWS(AB$2:AB66)),\"\")","v":""},{"$f":"IFERROR(INDEX(INDEX(OFFSET(Pro_2,0,3),MATCH($D$3,Pro_2,0)-1):INDEX(OFFSET(Pro_2,0,3),MATCH(2,1/(Pro_2=$D$3),1)),ROWS(AC$2:AC66)),\"\")","v":""},null,null,null,"","",{"$f":"IFERROR(INDEX(INDEX(Pro_3,MATCH($F$3,Pro_3,0)-1):INDEX(Pro_3,MATCH(2,1/(Pro_3=$F$3),1)),ROWS(AI$2:AI66)),\"\")","v":""},{"$f":"IFERROR(INDEX(INDEX(OFFSET(Pro_3,0,1),MATCH($F$3,Pro_3,0)-1):INDEX(OFFSET(Pro_3,0,1),MATCH(2,1/(Pro_3=$F$3),1)),ROWS(AJ$2:AJ66)),\"\")","v":""},{"$f":"IFERROR(INDEX(INDEX(OFFSET(Pro_3,0,2),MATCH($F$3,Pro_3,0)-1):INDEX(OFFSET(Pro_3,0,2),MATCH(2,1/(Pro_3=$F$3),1)),ROWS(AK$2:AK66)),\"\")","v":""},{"$f":"IFERROR(INDEX(INDEX(OFFSET(Pro_3,0,3),MATCH($F$3,Pro_3,0)-1):INDEX(OFFSET(Pro_3,0,3),MATCH(2,1/(Pro_3=$F$3),1)),ROWS(AL$2:AL66)),\"\")","v":""}]
[null,null,null,null,null,null,null,null,null,{"$f":"IF(ISNUMBER(P68),ROW(),\"\")","v":""},null,null,null,null,"",{"$f":"IFERROR(INDEX(INDEX(Pro_1,MATCH($B$3,Pro_1,0)-1):INDEX(Pro_1,MATCH(2,1/(Pro_1=$B$3),1)),ROWS(P$2:P67)),\"\")","v":""},{"$f":"IFERROR(INDEX(INDEX(OFFSET(Pro_1,0,1),MATCH($B$3,Pro_1,0)-1):INDEX(OFFSET(Pro_1,0,1),MATCH(2,1/(Pro_1=$B$3),1)),ROWS(Q$2:Q67)),\"\")","v":""},{"$f":"IFERROR(INDEX(INDEX(OFFSET(Pro_1,0,2),MATCH($B$3,Pro_1,0)-1):INDEX(OFFSET(Pro_1,0,2),MATCH(2,1/(Pro_1=$B$3),1)),ROWS(R$2:R67)),\"\")","v":""},{"$f":"IFERROR(INDEX(INDEX(OFFSET(Pro_1,0,3),MATCH($B$3,Pro_1,0)-1):INDEX(OFFSET(Pro_1,0,3),MATCH(2,1/(Pro_1=$B$3),1)),ROWS(S$2:S67)),\"\")","v":""},null,null,null,null,{"$f":"IF(ISNUMBER($Z68),ROW(),\"\")","v":""},"",{"$f":"IFERROR(INDEX(INDEX(Pro_2,MATCH($D$3,Pro_2,0)-1):INDEX(Pro_2,MATCH(2,1/(Pro_2=$D$3),1)),ROWS(Z$2:Z67)),\"\")","v":""},{"$f":"IFERROR(INDEX(INDEX(OFFSET(Pro_2,0,1),MATCH($D$3,Pro_2,0)-1):INDEX(OFFSET(Pro_2,0,1),MATCH(2,1/(Pro_2=$D$3),1)),ROWS(AA$2:AA67)),\"\")","v":""},{"$f":"IFERROR(INDEX(INDEX(OFFSET(Pro_2,0,2),MATCH($D$3,Pro_2,0)-1):INDEX(OFFSET(Pro_2,0,2),MATCH(2,1/(Pro_2=$D$3),1)),ROWS(AB$2:AB67)),\"\")","v":""},{"$f":"IFERROR(INDEX(INDEX(OFFSET(Pro_2,0,3),MATCH($D$3,Pro_2,0)-1):INDEX(OFFSET(Pro_2,0,3),MATCH(2,1/(Pro_2=$D$3),1)),ROWS(AC$2:AC67)),\"\")","v":""},null,null,null,{"$f":"IF(ISNUMBER($AI68),ROW(),\"\")","v":""},"",{"$f":"IFERROR(INDEX(INDEX(Pro_3,MATCH($F$3,Pro_3,0)-1):INDEX(Pro_3,MATCH(2,1/(Pro_3=$F$3),1)),ROWS(AI$2:AI67)),\"\")","v":""},{"$f":"IFERROR(INDEX(INDEX(OFFSET(Pro_3,0,1),MATCH($F$3,Pro_3,0)-1):INDEX(OFFSET(Pro_3,0,1),MATCH(2,1/(Pro_3=$F$3),1)),ROWS(AJ$2:AJ67)),\"\")","v":""},{"$f":"IFERROR(INDEX(INDEX(OFFSET(Pro_3,0,2),MATCH($F$3,Pro_3,0)-1):INDEX(OFFSET(Pro_3,0,2),MATCH(2,1/(Pro_3=$F$3),1)),ROWS(AK$2:AK67)),\"\")","v":""},{"$f":"IFERROR(INDEX(INDEX(OFFSET(Pro_3,0,3),MATCH($F$3,Pro_3,0)-1):INDEX(OFFSET(Pro_3,0,3),MATCH(2,1/(Pro_3=$F$3),1)),ROWS(AL$2:AL67)),\"\")","v":""}]
[null,null,null,null,null,null,null,null,null,"",null,null,null,null,"",{"$f":"IFERROR(INDEX(INDEX(Pro_1,MATCH($B$3,Pro_1,0)-1):INDEX(Pro_1,MATCH(2,1/(Pro_1=$B$3),1)),ROWS(P$2:P68)),\"\")","v":""},{"$f":"IFERROR(INDEX(INDEX(OFFSET(Pro_1,0,1),MATCH($B$3,Pro_1,0)-1):INDEX(OFFSET(Pro_1,0,1),MATCH(2,1/(Pro_1=$B$3),1)),ROWS(Q$2:Q68)),\"\")","v":""},{"$f":"IFERROR(INDEX(INDEX(OFFSET(Pro_1,0,2),MATCH($B$3,Pro_1,0)-1):INDEX(OFFSET(Pro_1,0,2),MATCH(2,1/(Pro_1=$B$3),1)),ROWS(R$2:R68)),\"\")","v":""},{"$f":"IFERROR(INDEX(INDEX(OFFSET(Pro_1,0,3),MATCH($B$3,Pro_1,0)-1):INDEX(OFFSET(Pro_1,0,3),MATCH(2,1/(Pro_1=$B$3),1)),ROWS(S$2:S68)),\"\")","v":""},null,null,null,null,"","",{"$f":"IFERROR(INDEX(INDEX(Pro_2,MATCH($D$3,Pro_2,0)-1):INDEX(Pro_2,MATCH(2,1/(Pro_2=$D$3),1)),ROWS(Z$2:Z68)),\"\")","v":""},{"$f":"IFERROR(INDEX(INDEX(OFFSET(Pro_2,0,1),MATCH($D$3,Pro_2,0)-1):INDEX(OFFSET(Pro_2,0,1),MATCH(2,1/(Pro_2=$D$3),1)),ROWS(AA$2:AA68)),\"\")","v":""},{"$f":"IFERROR(INDEX(INDEX(OFFSET(Pro_2,0,2),MATCH($D$3,Pro_2,0)-1):INDEX(OFFSET(Pro_2,0,2),MATCH(2,1/(Pro_2=$D$3),1)),ROWS(AB$2:AB68)),\"\")","v":""},{"$f":"IFERROR(INDEX(INDEX(OFFSET(Pro_2,0,3),MATCH($D$3,Pro_2,0)-1):INDEX(OFFSET(Pro_2,0,3),MATCH(2,1/(Pro_2=$D$3),1)),ROWS(AC$2:AC68)),\"\")","v":""},null,null,null,"","",{"$f":"IFERROR(INDEX(INDEX(Pro_3,MATCH($F$3,Pro_3,0)-1):INDEX(Pro_3,MATCH(2,1/(Pro_3=$F$3),1)),ROWS(AI$2:AI68)),\"\")","v":""},{"$f":"IFERROR(INDEX(INDEX(OFFSET(Pro_3,0,1),MATCH($F$3,Pro_3,0)-1):INDEX(OFFSET(Pro_3,0,1),MATCH(2,1/(Pro_3=$F$3),1)),ROWS(AJ$2:AJ68)),\"\")","v":""},{"$f":"IFERROR(INDEX(INDEX(OFFSET(Pro_3,0,2),MATCH($F$3,Pro_3,0)-1):INDEX(OFFSET(Pro_3,0,2),MATCH(2,1/(Pro_3=$F$3),1)),ROWS(AK$2:AK68)),\"\")","v":""},{"$f":"IFERROR(INDEX(INDEX(OFFSET(Pro_3,0,3),MATCH($F$3,Pro_3,0)-1):INDEX(OFFSET(Pro_3,0,3),MATCH(2,1/(Pro_3=$F$3),1)),ROWS(AL$2:AL68)),\"\")","v":""}]
[null,null,null,null,null,null,null,null,null,"",null,null,null,null,"",{"$f":"IFERROR(INDEX(INDEX(Pro_1,MATCH($B$3,Pro_1,0)-1):INDEX(Pro_1,MATCH(2,1/(Pro_1=$B$3),1)),ROWS(P$2:P69)),\"\")","v":""},{"$f":"IFERROR(INDEX(INDEX(OFFSET(Pro_1,0,1),MATCH($B$3,Pro_1,0)-1):INDEX(OFFSET(Pro_1,0,1),MATCH(2,1/(Pro_1=$B$3),1)),ROWS(Q$2:Q69)),\"\")","v":""},{"$f":"IFERROR(INDEX(INDEX(OFFSET(Pro_1,0,2),MATCH($B$3,Pro_1,0)-1):INDEX(OFFSET(Pro_1,0,2),MATCH(2,1/(Pro_1=$B$3),1)),ROWS(R$2:R69)),\"\")","v":""},{"$f":"IFERROR(INDEX(INDEX(OFFSET(Pro_1,0,3),MATCH($B$3,Pro_1,0)-1):INDEX(OFFSET(Pro_1,0,3),MATCH(2,1/(Pro_1=$B$3),1)),ROWS(S$2:S69)),\"\")","v":""},null,null,null,null,"","",{"$f":"IFERROR(INDEX(INDEX(Pro_2,MATCH($D$3,Pro_2,0)-1):INDEX(Pro_2,MATCH(2,1/(Pro_2=$D$3),1)),ROWS(Z$2:Z69)),\"\")","v":""},{"$f":"IFERROR(INDEX(INDEX(OFFSET(Pro_2,0,1),MATCH($D$3,Pro_2,0)-1):INDEX(OFFSET(Pro_2,0,1),MATCH(2,1/(Pro_2=$D$3),1)),ROWS(AA$2:AA69)),\"\")","v":""},{"$f":"IFERROR(INDEX(INDEX(OFFSET(Pro_2,0,2),MATCH($D$3,Pro_2,0)-1):INDEX(OFFSET(Pro_2,0,2),MATCH(2,1/(Pro_2=$D$3),1)),ROWS(AB$2:AB69)),\"\")","v":""},{"$f":"IFERROR(INDEX(INDEX(OFFSET(Pro_2,0,3),MATCH($D$3,Pro_2,0)-1):INDEX(OFFSET(Pro_2,0,3),MATCH(2,1/(Pro_2=$D$3),1)),ROWS(AC$2:AC69)),\"\")","v":""},null,null,null,"","",{"$f":"IFERROR(INDEX(INDEX(Pro_3,MATCH($F$3,Pro_3,0)-1):INDEX(Pro_3,MATCH(2,1/(Pro_3=$F$3),1)),ROWS(AI$2:AI69)),\"\")","v":""},{"$f":"IFERROR(INDEX(INDEX(OFFSET(Pro_3,0,1),MATCH($F$3,Pro_3,0)-1):INDEX(OFFSET(Pro_3,0,1),MATCH(2,1/(Pro_3=$F$3),1)),ROWS(AJ$2:AJ69)),\"\")","v":""},{"$f":"IFERROR(INDEX(INDEX(OFFSET(Pro_3,0,2),MATCH($F$3,Pro_3,0)-1):INDEX(OFFSET(Pro_3,0,2),MATCH(2,1/(Pro_3=$F$3),1)),ROWS(AK$2:AK69)),\"\")","v":""},{"$f":"IFERROR(INDEX(INDEX(OFFSET(Pro_3,0,3),MATCH($F$3,Pro_3,0)-1):INDEX(OFFSET(Pro_3,0,3),MATCH(2,1/(Pro_3=$F$3),1)),ROWS(AL$2:AL69)),\"\")","v":""}]

{"sheet":"Gearbox oil cooler","index":80,"n_rows":135,"n_cols":4,"rows_kept":135,"cut":false,"hidden":false,"merged":[]}
["PTO type","Power line (kW)","Operation Type","PIC"]
["ED70P",50,"Continuous"]
["ED70P",113,"Periodic"]
["ED120P",75,"Continuous"]
["ED120P",142,"Periodic"]
["ED160P",85,"Continuous"]
["ED160P",189,"Periodic"]
["EK730P",120,"Continuous"]
["EK730P",170,"Periodic (without oil cooler for gearbox), Continuous (with water cooling for gearbox oil)"]
["EK730P",200,"Periodic(with water cooling for gearbox oil), Continuous (with air cooling for gearbox oil)"]
["EK730P",250,"Continuous with cooling capacity with at least 13 kW"]
["EK740F",120,"Continuous"]
["EK740F",170,"Periodic(without oil cooler for gearbox), Continuous (with water cooling for gearbox oil)"]
["EK740F",200,"Periodic(with water cooling for gearbox oil), Continuous (with air cooling for gearbox oil)"]
["EK740F",250,"Continuous with cooling capacity with at least 13 kW"]
["EK750F",120,"Continuous"]
["EK750F",170,"Periodic(without oil cooler for gearbox), Continuous (with water cooling for gearbox oil)"]
["EG730P",120,"Continuous"]
["EG730P",170,"Periodic (without oil cooler for gearbox), Continuous (with water cooling for gearbox oil)"]
["EG730P",200,"Periodic (with water cooling for gearbox oil), Continuous (with air cooling for gearbox oil)"]
["EG730P",250,"Continuous with cooling capacity with at least 13 kW"]
["EG740F",120,"Continuous"]
["EG740F",170,"Periodic (without oil cooler for gearbox), Continuous (with water cooling for gearbox oil)"]
["EG740F",200,"Periodic (with water cooling for gearbox oil), Continuous (with air cooling for gearbox oil)"]
["EG740F",250,"Continuous with cooling capacity with at least 13 kW"]
["EG500P",60,"Continuous"]
["EG500P",90,"Periodic(without oil cooler for gearbox), Continuous(with oil cooler for gearbox)"]
["EG500F",60,"Continuous"]
["EG500F",90,"Periodic (without oil cooler for gearbox), Continuous (with oil cooler for gearbox)"]
["EG502P",60,"Continuous"]
["EG502P",90,"Periodic (without oil cooler for gearbox), Continuous (with oil cooler for gearbox)"]
["EG502F",60,"Continuous"]
["EG502F",90,"Periodic (without oil cooler for gearbox), Continuous (with oil cooler for gearbox)"]
["EG501P",60,"Continuous"]
["EG501P",90,"Periodic (without oil cooler for gearbox), Continuous (with oil cooler for gearbox)"]
["EG501F",60,"Continuous"]
["EG501F",90,"Periodic (without oil cooler for gearbox), Continuous (with oil cooler for gearbox)"]
["EG503P",60,"Continuous"]
["EG503P",90,"Periodic (without oil cooler for gearbox), Continuous (with oil cooler for gearbox)"]
["EG503F",60,"Continuous"]
["EG503F",90,"Periodic (without oil cooler for gearbox), Continuous (with oil cooler for gearbox)"]
["EG640F",70,"Continuous"]
["EG640F",100,"Periodic(without oil cooler for gearbox), Continuous(with oil cooler for gearbox)"]
["EG640P",70,"Continuous"]
["EG640P",100,"Periodic (without oil cooler for gearbox), Continuous (with oil cooler for gearbox)"]
["EG641P",70,"Continuous"]
["EG641P",100,"Periodic (without oil cooler for gearbox), Continuous (with oil cooler for gearbox)"]
["EG641F",70,"Continuous"]
["EG641F",100,"Periodic (without oil cooler for gearbox), Continuous (with oil cooler for gearbox)"]
["EG642P",70,"Continuous"]
["EG642P",100,"Periodic(without oil cooler for gearbox), Continuous(with oil cooler for gearbox)"]
["EG642F",70,"Continuous"]
["EG642F",100,"Periodic (without oil cooler for gearbox), Continuous (with oil cooler for gearbox)"]
["EG643P",70,"Continuous"]
["EG643P",100,"Periodic(without oil cooler for gearbox), Continuous(with oil cooler for gearbox)"]
["EG643F",70,"Continuous"]
["EG643F",100,"Periodic (without oil cooler for gearbox), Continuous (with oil cooler for gearbox)"]
["EG644P",120,"Continuous"]
["EG644F",120,"Continuous"]
["EG645P",120,"Continuous"]
["EG645F",120,"Continuous"]
["EG646P",120,"Continuous"]
["EG646F",120,"Continuous"]
["EG647P",120,"Continuous"]
["EG647F",120,"Continuous"]
["EG650P",80,"Continuous"]
["EG650P",120,"Periodic(without oil cooler for gearbox), Continuous(with oil cooler for gearbox)"]
["EG660F",80,"Continuous"]
["EG660F",120,"Periodic (without oil cooler for gearbox), Continuous (with oil cooler for gearbox)"]
["EG651P",80,"Continuous"]
["EG651P",120,"Periodic (without oil cooler for gearbox), Continuous (with oil cooler for gearbox)"]
["EG661F",80,"Continuous"]
["EG661F",120,"Periodic (without oil cooler for gearbox), Continuous (with oil cooler for gearbox)"]
["EG652P",80,"Continuous"]
["EG652P",120,"Periodic (without oil cooler for gearbox), Continuous (with oil cooler for gearbox)"]
["EG662F",80,"Continuous"]
["EG662F",120,"Periodic (without oil cooler for gearbox), Continuous (with oil cooler for gearbox)"]
["EG653P",80,"Continuous"]
["EG653P",120,"Periodic (without oil cooler for gearbox), Continuous (with oil cooler for gearbox)"]
["EG663F",80,"Continuous"]
["EG663F",120,"Periodic (without oil cooler for gearbox), Continuous (with oil cooler for gearbox)"]
["EG670F",110,"Continuous"]
["EG671F",110,"Continuous"]
["EG672F",110,"Continuous"]
["EG670PF U",110,"Continuous"]
["EG670PF L",110,"Continuous"]
["EG671PF U",110,"Continuous"]
["EG671PF L",110,"Continuous"]
["EG672PF U",110,"Continuous"]
["EG672PF L",110,"Continuous"]
["EG670PP U",110,"Continuous"]
["EG671PP U",110,"Continuous"]
["EG670PP L",110,"Continuous"]
["EG671PP L",110,"Continuous"]
["EG672PP U",110,"Continuous"]
["EG673PP U",110,"Continuous"]
["EG672PP L",110,"Continuous"]
["EG673PP L",110,"Continuous"]
["EG6R DDxxB",100,"Continuous"]
["EG6R DDxxB",160,"Continuous(with oil cooler for gearbox)"]
["EG8R DCxxB",100,"Continuous"]
["EG8R DCxxB",160,"Continuous (with oil cooler for gearbox)"]
["EG9R DCxxB",100,"Continuous"]
["EG9R DCxxB",160,"Continuous (with oil cooler for gearbox)"]
["EG10R DCxxB",100,"Continuous"]
["EG10R DCxxB",160,"Continuous (with oil cooler for gearbox)"]
["EG25R DAxx",250,"Continuous"]
["EG10R DDxxyy U",100,"Continuous"]
["EG10R DDxxyy U",150,"Continuous (with oil cooler for gearbox)"]
["EG10R DDxxyy L",100,"Continuous"]
["EG10R DDxxyy L",160,"Continuous (with oil cooler for gearbox)"]
["EG10R DDxxyy L&U",100,"Continuous"]
["EG10R DDxxyy L&U",160,"Continuous (with oil cooler for gearbox)"]
["EG12R DCxxyy U",100,"Continuous"]
["EG12R DCxxyy U",160,"Continuous (with oil cooler for gearbox)"]
["EG12R DCxxyy L",100,"Continuous"]
["EG12R DCxxyy L",160,"Continuous (with oil cooler for gearbox)"]
["EG12R DCxxyy L&U",100,"Continuous"]
["EG12R DCxxyy L&U",160,"Continuous (with oil cooler for gearbox)"]
["EG13R DCxxyy U",100,"Continuous"]
["EG13R DCxxyy U",160,"Continuous (with oil cooler for gearbox)"]
["EG13R DCxxyy L",100,"Continuous"]
["EG13R DCxxyy L",160,"Continuous (with oil cooler for gearbox)"]
["EG13R DCxxyy U&L",100,"Continuous"]
["EG13R DCxxyy U&L",160,"Continuous (with oil cooler for gearbox)"]
["EG16R DCxxyy U",100,"Continuous"]
["EG16R DCxxyy U",160,"Continuous (with oil cooler for gearbox)"]
["EG16R DCxxyy L",100,"Continuous"]
["EG16R DCxxyy L",160,"Continuous (with oil cooler for gearbox)"]
["EG16R DCxxyy U&L",100,"Continuous"]
["EG16R DCxxyy U&L",160,"Continuous (with oil cooler for gearbox)"]
["ED10R WBP1",238,"Continuous"]
["ED10R WBF4",238,"Continuous"]
["ED7R WBF3",167,"Continuous"]
["EG15R DCxx",260,"Continuous"]

{"sheet":"GEM Startblad","index":81,"n_rows":0,"n_cols":0,"rows_kept":0,"cut":false,"hidden":false,"merged":[]}

{"sheet":"PTO lathund 3","index":82,"n_rows":36,"n_cols":20,"rows_kept":36,"cut":false,"hidden":false,"merged":[[3,14,3,15],[3,16,3,17],[30,1,33,1],[34,2,34,3],[0,5,0,16],[1,7,1,8],[1,9,1,10],[1,14,1,15],[1,16,1,17],[3,2,3,3],[3,5,3,6],[3,7,3,8],[3,9,3,10],[3,12,3,13]]}
[null,null,null,null,null,"PTO Configurator GZ & GW gearbox"]
[null,null,"Crane",null,null,"Pump",null,"PTO 1",null,"Engine\nspeed 1",null,null,"Pump",null,"PTO 2",null,"Engine\nspeed 2",null,null,"updated 2020-02-24"]
[null,null,{"$f":"Cranes!B2","v":0}]
[null,null,"A1 Optional pressure.\nPTO configurator",null,250,"Parker VP1-095",null,"EG16RDCxxyy L",null,800,null,"to compare with","Rexroth A18VO-80",null,"ED10RWBF4",null,800]
[null,null,"Torque (Nm)","M",null,null,null,null,{"$f":"IF($E$30=FALSE,VLOOKUP($H$4,'PTO Technical data'!$A$7:$F$127,6,0),VLOOKUP($H$4,'PTO Technical data'!$A$7:$H$127,8,0))","v":1000},null,null,null,null,null,null,{"$f":"IF($M$30=FALSE,VLOOKUP($O$4,'PTO Technical data'!$A$7:$F$127,6,0),VLOOKUP($O$4,'PTO Technical data'!$A$7:$H$127,8,0))","v":1000},null,"M","Torque (Nm)"]
[null,null,"Displacement (cm3/rev)","D",null,{"$f":"VLOOKUP($F$4,'Hydraulic pumpdata'!$A$5:$L$100,3,0)","v":95},{"$f":"'PTO lathund 3'!H21","v":114.37908496732027},null,null,null,null,null,{"$f":"VLOOKUP($M$4,'Hydraulic pumpdata'!$A$5:$L$100,3,0)","v":80},{"$f":"Q21","v":145.83333333333334},null,null,null,"D","Displacement for pump (cm3/rev)"]
[null,null,"System pressure (bar)","Pbar",{"$f":"E4","v":250},{"$f":"VLOOKUP($F$4,'Hydraulic pumpdata'!$A$5:$L$100,10,0)","v":400},{"$f":"VLOOKUP($F$4,'Hydraulic pumpdata'!$A$5:$L$100,6,0)","v":166.25},null,null,null,null,null,{"$f":"VLOOKUP($M$4,'Hydraulic pumpdata'!$A$5:$L$100,10,0)","v":350},{"$f":"VLOOKUP($M$4,'Hydraulic pumpdata'!$A$5:$L$100,6,0)","v":179},null,null,null,"Pbar","System pressure (bar)"]
[null,null,"Power (kW)","P",{"$f":"LOOKUP($C$4,Cranes!$A$8:$A$32,Cranes!$E$8:$E$32)","v":"-"},null,null,null,{"$f":"IF($I$30=FALSE,VLOOKUP($H$4,'PTO Technical data'!$A$7:$M$127,13,0),VLOOKUP($H$4,'PTO Technical data'!$A$7:$N$127,14,0))","v":160},null,null,null,null,null,null,{"$f":"IF($R$30=FALSE,VLOOKUP($O$4,'PTO Technical data'!$A$7:$M$127,13,0),VLOOKUP($O$4,'PTO Technical data'!$A$7:$N$127,14,0))","v":238},null,"P","Power  (kW)"]
[null,null,"Choosen engine speed (rpm)","N",null,{"$f":"VLOOKUP($F$4,'Hydraulic pumpdata'!$A$5:$L$100,4,0)","v":1750},{"$f":"VLOOKUP($F$4,'Hydraulic pumpdata'!$A$5:$L$100,5,0)","v":1800},null,{"$f":"J4*I10","v":1224},null,null,null,{"$f":"VLOOKUP($M$4,'Hydraulic pumpdata'!$A$5:$L$100,4,0)","v":2240},{"$f":"VLOOKUP($M$4,'Hydraulic pumpdata'!$A$5:$L$100,5,0)","v":3000},null,{"$f":"$Q$4*$P$10","v":960},null,"N","Choosen engine speed (rpm)"]
[null,null,"PTO gear ratio","Z",null,null,null,null,{"$f":"IF($E$30=FALSE,VLOOKUP($H$4,'PTO Technical data'!$A$7:$F$127,4,0),VLOOKUP($H$4,'PTO Technical data'!$A$7:$H$127,5,0))","v":1.53},null,null,null,null,null,null,{"$f":"IF($M$30=FALSE,VLOOKUP($O$4,'PTO Technical data'!$A$7:$F$127,4,0),VLOOKUP($O$4,'PTO Technical data'!$A$7:$H$127,5,0))","v":1.2},null,"Z","PTO gear ratio"]
[null,null,"Pump efficiency",{"$f":"IF(G11=0,0.95,LOOKUP(F4,'Hydraulic pumpdata'!A5:A52,'Hydraulic pumpdata'!L5:L52))","v":0.98},null,null,{"$f":"VLOOKUP($F$4,'Hydraulic pumpdata'!$A$5:$L$100,12,0)","v":0.98},null,null,null,null,null,null,{"$f":"VLOOKUP($M$4,'Hydraulic pumpdata'!$A$5:$L$100,12,0)","v":0.95},null,null,null,{"$f":"IF(N11=0,0.95,LOOKUP(M4,'Hydraulic pumpdata'!A5:A52,'Hydraulic pumpdata'!L5:L52))","v":0.95},"Pump efficiency"]
[null,null,"Flow rate at pump speed","Q",{"$f":"LOOKUP($C$4,Cranes!$A$8:$A$32,Cranes!$D$8:$D$32)","v":"-"},null,null,null,null,null,null,null,null,null,null,null,null,"Q","Flow rate at pump speed"]
[]
[]
[]
[]
[]
[null,null,null,null,"Q","engine","Z","D",null,null,null,null,null,"Q","engine","Z","D"]
[null,null,null,null,"flow","rpm","ratio","cm3",null,null,null,null,null,"flow","rpm","ratio","cm3"]
[]
[null,null,null,null,{"$f":"'PTO lathund 3'!B31","v":140},{"$f":"'PTO lathund 3'!J4","v":800},{"$f":"'PTO lathund 3'!I10","v":1.53},{"$f":"SUM((E21*1000)/(F21*G21))","v":114.37908496732027},null,null,null,null,null,{"$f":"B31","v":140},{"$f":"Q4","v":800},{"$f":"P10","v":1.2},{"$f":"SUM((N21*1000)/(O21*P21))","v":145.83333333333334}]
[]
[]
[]
[]
[]
[]
[null,null,null,null,"RESULT PTO 1",null,null,null,null,null,null,null,"RESULT PTO 2"]
[null,null,null,null,null,null,null,null,null,null,null,"DIFFERENCE"]
["LINKS","Enter requested volume\n",null,"Change Split -gear in this row -->",true,null,{"$f":"IF(E30=TRUE,\"High\",IF(E30=FALSE,\"Low\",\"\"))","v":"High"},null,true,null,null,{"$f":"IF(G30=O30,\"<-Equal->\",IF(G30>O30,\"High -->\",\"<-- High\"))","v":"<-Equal->"},true,null,{"$f":"IF(M30=TRUE,\"High\",IF(M30=FALSE,\"Low\",\"\"))","v":"High"},null,null,false]
["Parker fixed",140,null,0,"M=",{"$f":"SUM(F6*E7)/63","v":376.98412698412699},"Nm          (Torque load at PTO)",null,null,null,null,{"$f":"N31-F31","v":-59.523809523809518},"M=",{"$f":"SUM(M6*E7)/63","v":317.46031746031747},"Nm          (Torque load at PTO)"]
["Parker variable",null,null,null,"P=",{"$f":"SUM(F6*J4*I10*E7)/(600*D11*1000)","v":49.438775510204081},"Kw",{"$f":"IF($I$30=TRUE,\"(Power with gearbox cooler)\",\"(Power without gearbox cooler)\")","v":"(Power with gearbox cooler)"},null,null,null,{"$f":"N32-F32","v":-15.754564983888294},"P=",{"$f":"SUM(M6*Q4*P10*E7)/(600*R11*1000)","v":33.684210526315788},"Kw",{"$f":"IF($R$30=TRUE,\"(Power with gearbox cooler)\",\"(Power without gearbox cooler)\")","v":"(Power without gearbox cooler)"}]
["Rexroth fixed",null,null,null,"Q=",{"$f":"$F$6*I9/1000","v":116.28},"Litres/minute at",null,"engine speed",null,{"$f":"J4","v":800},{"$f":"N33-F33","v":-39.480000000000004},"Q=",{"$f":"$M$6*P9/1000","v":76.8},"Litres/minute at",null,"engine speed",null,null,{"$f":"Q4","v":800}]
["Sunfab"]
["Hyva","Pre-wired cables for each PTO at the factory preparation.","Engine torque and speed should be limited with SDP3 to the following values​​:",null,"other info\npump","other info","can be combined with","location","suitable\nfor","rotation of PTO","location",null,"other info\npump","other info","can be combined with",null,"location","suitable\nfor","rotation of PTO","location"]
[null,"EK - V43;\nED1 - V122;  ED2 - V150;\nEG1 - V13;  EG3 - V181\n",{"$f":"F31*I10","v":576.78571428571433},{"$f":"K33","v":800},{"$f":"LOOKUP($F$4,'Hydraulic pumpdata'!$A$5:$A$52,'Hydraulic pumpdata'!B5:B52)","v":"variable"},{"$f":"VLOOKUP(H4,'PTO Technical data'!A7:S127,10,FALSE)","v":"Double output high ratio\nIndependant engagement"},{"$f":"VLOOKUP(H4,'PTO Technical data'!A7:S127,11,FALSE)","v":0},{"$f":"VLOOKUP(H4,'PTO Technical data'!A7:S127,17,FALSE)","v":5},{"$f":"VLOOKUP(H4,'PTO Technical data'!A7:S127,12,FALSE)","v":"G25, G33, G38"},{"$f":"VLOOKUP(H4,'PTO Technical data'!A7:S127,19,FALSE)","v":"CCW"},{"$f":"VLOOKUP(H4,'PTO Technical data'!A7:S127,18,FALSE)","v":"rear"},null,{"$f":"LOOKUP($M$4,'Hydraulic pumpdata'!$A$5:$A$52,'Hydraulic pumpdata'!B5:B52)","v":"variable pump  "},{"$f":"LOOKUP($O$4,'PTO Technical data'!$A$7:$A$127,'PTO Technical data'!J7:J127)","v":"300Nm while running. \nClutch independent"},{"$f":"LOOKUP($O$4,'PTO Technical data'!$A$7:$A$127,'PTO Technical data'!K7:K127)","v":0},null,{"$f":"LOOKUP(O4,'PTO Technical data'!A7:A127,'PTO Technical data'!Q7:Q127)","v":2},{"$f":"LOOKUP($O$4,'PTO Technical data'!$A$7:$A$127,'PTO Technical data'!L7:L127)","v":"D7"},{"$f":"LOOKUP($O$4,'PTO Technical data'!$A$7:$A$127,'PTO Technical data'!S7:S127)","v":"CCW"},{"$f":"LOOKUP($O$4,'PTO Technical data'!$A$7:$A$127,'PTO Technical data'!R9:R127)","v":"engine"}]

{"sheet":"PTO Technical data","index":83,"n_rows":126,"n_cols":19,"rows_kept":126,"cut":false,"hidden":false,"merged":[[1,1,1,3],[2,4,4,9]]}
[null,null,null,null,null,null,null,null,null,null,null,null,null,null,null,null,null,"uppdated 2020-02-24"]
[null,"PTO chosen 1 & 2 from \"PTO Configurator"]
[null,null,null,null,"PTO Technical data"]
[]
[]
["Designation\nU = Upper\nL = Lower","variant\ncode","Connection type","low\nratio","high\nratio","Output torque (Nm)\nlow","Output torque (Nm)with cooler","Output torque (Nm)\nhigh","Output torque (Nm) with cooler","other\ninfo","can be combined with other PTO","With gearbox or engine type","Power at \nlow ratio\n(Kw)","Power (Kw) with cooler","Power at\nhigh ratio\n(Kw)","Power (Kw) with cooler","location (clock mode, seen from rear of chassis)","location\n(side or rear of gearbox or engine).","Direction of rotation"]
["ED070","4827D","pump",1.2,1.2,500,null,500,null,"300Nm while running. \nClutch independent",null,"D7",50,113,50,113,2,"engine","CCW"]
["ED120","4827B","pump",1.19,1.19,600,null,600,null,"300Nm while running. \nClutch independent",null,"D9 D11\nD12 D13",75,142,50,113,2,"engine","CCW"]
["ED160","4827C","pump",1.19,1.19,800,null,800,null,"300Nm whlie running. \nClutch independent",null,"D16",85,189,85,189,2,"engine","CW"]
["ED10RWBP1","4827E","pump",1.2,1.2,1000,null,1000,null,"300Nm whlie running. \nClutch independent",null,"DW6",238,238,238,238,2,"engine","CW"]
["ED10RWBF4","4827H","Flange",1.2,1.2,1000,null,1000,null,"300Nm whlie running. \nClutch independent",null,"DW6",238,238,238,238,2,"engine","CW"]
["ED7RWBF3","4827G","Flange",1.2,1.2,700,null,700,null,"300Nm whlie running. \nClutch independent",null,"DW6",167,167,167,167,2,"engine","CW"]
["EG10RDCxx","6392EL","pump or flange",1.19,1.53,1000,null,1000,null,"Single PTO w high ratio",null,"G25, G33, G38",100,160,100,160,5,"rear","CCW"]
["EG112F","3852CA","flange",1.17,1.17,395,565,395,565,"Discontinued",null,"GA750\nGA751\nGA765/R\nGA766/R",92,106,null,null,9,"side","CCW"]
["EG113F","6391AA","flange",1.1299999999999999,1.1299999999999999,582,null,582,null,"SAE1410",null,"GA765\nGA766",69,null,null,null,9,"side","CCW"]
["EG11RDDxxyy L","6392FJ","pump or flange",1.63,2.09,600,null,600,null,"Double output high ratio\nIndependant engagement",null,"G25, G33, G38",100,160,100,160,5,"rear","CCW"]
["EG11RDDxxyy U","6392FJ","pump or flange",1.63,2.09,360,null,360,null,"Double output high ratio\nIndependant engagement",null,"G25, G33, G38",100,160,100,160,5,"rear","CCW"]
["EG12RDCxxyy L","6392FC","pump or flange",1.51,1.95,800,null,800,null,"Double output high ratio\nIndependant engagement",null,"G25, G33, G38",100,160,100,160,5,"rear","CCW"]
["EG12RDCxxyy U","6392FC","pump or flange",1.51,1.95,480,null,480,null,"Double output high ratio\nIndependant engagement",null,"G25, G33, G38",100,160,100,160,5,"rear","CCW"]
["EG13RDCxxyy L","6392FB","pump or flange",1.39,1.79,860,null,860,null,"Double output high ratio\nIndependant engagement",null,"G25, G33, G38",100,160,100,160,5,"rear","CCW"]
["EG13RDCxxyy U","6392FB","pump or flange",1.39,1.79,520,null,520,null,"Double output high ratio\nIndependant engagement",null,"G25, G33, G38",100,160,100,160,5,"rear","CCW"]
["EG16RDCxxyy L","6392FH","pump or flange",1.19,1.53,1000,null,1000,null,"Double output high ratio\nIndependant engagement",null,"G25, G33, G38",100,160,100,160,5,"rear","CCW"]
["EG16RDCxxyy U","6392FH","pump or flange",1.19,1.53,600,null,600,null,"Double output high ratio\nIndependant engagement",null,"G25, G33, G38",100,160,100,160,5,"rear","CCW"]
["EG210F","3852CB","flange",1.08,1.08,545,625,545,625,"Discontinued\nEnhanced performance (S-ord 859R).\nMax 850Nm\nCont. 780Nm\n",null,"GA851\nGA852\nGA866/R\nGA867/R",117,134,null,null,1,"side","CCW"]
["EG211F","6389AA","flange",1.1599999999999999,1.1599999999999999,801,null,801,null,"SAE1410",null,"GA866\nGA867",84,null,null,null,1,"side","CCW"]
["EG25RDAP1","6392EA","pump or flange",0.76,0.97,2500,null,2500,null,"Direct mounted PTO",null,"G25, G33, G38",250,250,250,250,5,"rear","CW"]
["EG500F (GR)","6390AB","flange",1.33,1.33,400,null,null,null,"Single output EG","EG650P\nEG660F\nEK730P\nEK740F","GR875\nGR905",60,90,null,null,5,"side","CW"]
["EG500F (GRS)","6390AB","flange",1.33,1.65,400,null,400,null,"Single output EG","EG650P\nEG660F\nEK730P\nEK740F","GRS895\nGRS905",60,90,60,90,5,"side","CW"]
["EG500P (GR)","6390AA","pump",1.33,1.33,400,null,null,null,"Single output EG","EG650P\nEG660F\nEK730P\nEK740F","GR875\nGR905",60,90,null,null,5,"side","CW"]
["EG500P (GRS)","6390AA","pump",1.33,1.65,400,null,400,null,"Single output EG","EG650P\nEG660F\nEK730P\nEK740F","GRS895\nGRS905",60,90,60,90,5,"side","CW"]
["EG501F (GRSO)","6390AD","flange",1.78,2.2200000000000002,400,null,400,null,"Single output EG","EG652P\nEG662F","GRSO905\nGRSO925",60,90,60,90,5,"side","CW"]
["EG501P (GRSO)","6390AC","pump",1.78,2.2200000000000002,400,null,400,null,"Single output EG","EG652P\nEG662F","GRSO905\nGRSO925",60,90,60,90,5,"side","CW"]
["EG502F (GRS)","6390AF","flange",1.33,1.65,400,null,400,null,"Single output EG","Not together with rear-mounted PTO","GRS895\nGRS905",60,90,60,90,5,"side","CW"]
["EG502F (GR)","6390AE","flange",1.33,null,400,null,null,null,"Single output EG","Not together with rear-mounted PTO","GR875\nGR905",60,90,null,null,5,"side","CW"]
["EG502P (GR)","6390AE","pump",1.33,null,400,null,null,null,"Single output EG","Not together with rear-mounted PTO","GRS895\nGRS905",60,90,null,null,5,"side","CW"]
["EG502P (GRS)","6390AE","pump",1.33,1.65,400,null,400,null,"Single output EG","Not together with rear-mounted PTO","GRS895\nGRS905",60,90,60,90,5,"side","CW"]
["EG503F (GRSO)","6390AH","flange",1.78,2.2200000000000002,400,null,400,null,"Single output EG","Not with rear-mounted PTO","GRSO905\nGRSO925",60,90,60,90,5,"side","CW"]
["EG503P (GRSO)","6390AG","pump",1.78,2.2200000000000002,400,null,400,null,"Single output EG","Not with rear-mounted PTO","GRSO905\nGRSO925",60,90,60,90,5,"side","CW"]
["EG551P","3853CA","pump",0.54,0,800,null,null,null,"Discontinued",null,"G670",85,null,null,null,6,"rear","CW"]
["EG561F","19BT","flange",0.54,0,800,null,null,null,"Discontinued",null,"G670",85,null,null,null,6,"side","CW"]
["EG600P","3852BA","pump",1.45,1.78,600,null,500,null,"Discontinued",null,"GRS890\nGRS900\nGRS920",74,110,74,110,5,"side","CW"]
["EG601P","3852BB","pump",1.24,0,700,null,null,null,"Discontinued",null,"GR900",74,110,74,null,5,"side","CW"]
["EG603P","3852BC","pump",1.1299999999999999,0,700,null,null,null,"Discontinued",null,"GR801",74,110,74,null,5,"side","CW"]
["EG604P","3852BD","pump",1.1200000000000001,1.37,700,null,600,null,"Discontinued",null,"GRS890\nGRS900\nGRS920",74,110,74,110,5,"side","CW"]
["EG606P (GRSO)","3852BE","pump",1.1599999999999999,1.44,700,null,600,null,"Discontinued",null,"GRSO900",74,110,74,110,5,"side","CW"]
["EG610F","3852BF","flange",0.94,1.1499999999999999,1200,null,1100,null,"Discontinued",null,"GRS890\nGRS900\nGRS920",74,110,74,110,5,"side","CCW"]
["EG611F","3852BG","flange",0.93,0,1200,null,null,null,"Discontinued",null,"GR900",74,null,null,null,5,"side","CCW"]
["EG612F","3852BH","flange",0.92,0,1200,null,null,null,"Discontinued",null,"GR801",74,null,null,null,5,"side","CCW"]
["EG620F","3852BJ","flange",1.45,1.78,600,null,500,null,"Single flange,Discontinued",null,"GRS890\nGRS900\nGRS920",74,null,74,null,5,"side","CW"]
["EG620FF","3852BJ","flangex2",0.94,1.1499999999999999,1200,null,1100,null,"Double flange, Discontinued",null,"GRS890\nGRS900\nGRS920",74,110,74,110,5,"side","CCW"]
["EG621F","3852BK","flange",1.24,0,700,null,null,null,"Single flange,Discontinued",null,"GR900",74,110,null,null,5,"side","CW"]
["EG621FF","3852BK","flangex2",0.93,0,1200,null,null,null,"Double flange, Discontinued",null,"GR900",74,110,null,null,5,"side","CCW"]
["EG640F (GR)","3853AA","flange",1.65,0,430,null,null,null,"Single output EG\nrepl. by EG644",null,"GR875\nGR905",70,100,null,null,5,"rear","CW"]
["EG640P (GRS)","3853AB","pump",1.65,2.04,430,null,430,null,"Single output EG\nrepl. by EG644",null,"GRS895\nGRS905",70,100,70,110,5,"rear","CW"]
["EG641F (GRSO)","3853AC","flange",1.33,1.67,430,null,430,null,"Single output EG\nrepl. by EG645",null,"GRSO905\nGRSO925",70,100,70,110,5,"rear","CW"]
["EG641P (GRSO)","3853AD","pump",1.33,1.67,430,null,430,null,"Single output EG\nrepl. by EG645",null,"GRSO905\nGRSO925",70,100,70,110,5,"rear","CW"]
["EG642F (GR)","03853CC","flange",1.29,null,430,null,null,null,"Single output EG\nrepl. by EG646",null,"GR875\nGR895",70,100,null,null,5,"rear","CW"]
["EG642F (GRS)","03853CC","flange",1.29,1.6,430,null,430,null,"Single output EG\nrepl. by EG646",null,"GRS895\nGRS905",70,100,70,100,"P1","rear","CW"]
["EG642P (GR)","03853CD","pump",1.29,null,430,null,null,null,"Single output EG\nrepl. by EG646",null,"GR875\nGR895",70,100,null,null,5,"rear","CW"]
["EG642P (GRS)","03853CD","pump",1.29,1.6,430,null,430,null,"Single output EG\nrepl. by EG646",null,"GRS895\nGRS905",70,100,70,100,5,"rear","CW"]
["EG643F (GRSO)","03853CE","flange",1.06,1.33,430,null,430,null,"Single output EG\nrepl. by EG647",null,"GRSO905",70,100,70,100,5,"rear","CW"]
["EG644F (GRS)","06392CH","flange",1.48,1.83,800,null,800,null,"Single output EG\nDIN100",null,"GRS895\nGRS905",120,120,120,120,5,"rear","CW"]
["EG644P (GRS)","6392CG","pump",1.48,1.83,800,null,800,null,"Single output EG",null,"GRS895\nGRS905",120,120,120,120,5,"rear","CW"]
["EG645F (GRS)","6392CK","flange",1.89,2.34,600,null,600,null,"Single output EG\nDIN100",null,"GRS895\nGRS905",120,120,120,120,5,"rear","CW"]
["EG645P (GRS)","6392CJ","pump",1.89,2.34,600,null,600,null,"Single output EG",null,"GRS895\nGRS905",120,120,120,120,5,"rear","CW"]
["EG646F (GRSO)","6392CM","flange",1.21,1.52,800,null,800,null,"Single output EG\nDIN100",null,"GRSO905\nGRSO925",120,120,120,120,5,"rear","CW"]
["EG646P (GRSO)","6392CL","pump",1.21,1.52,800,null,800,null,"Single output EG",null,"GRSO905\nGRSO925",120,120,120,120,5,"rear","CW"]
["EG647P(GRSO)","6392CN","pump",1.53,1.91,600,null,600,null,"Single output EG",null,"GRSO905\nGRSO925",120,120,120,120,5,"rear","CW"]
["EG647F(GRSO)","6392CP","flange",1.53,1.91,600,null,600,null,"Single output EG\nDIN100",null,"GRSO905\nGRSO925",120,120,120,120,5,"rear","CW"]
["EG650P (GR)","6392AJ","pump",1,0,1300,null,null,null,"Single output EG","EG500P/F","GR905\nGR875",80,120,null,null,5,"rear","CCW"]
["EG650P (GRS)","6392AJ","pump",1,1.24,1300,null,1300,null,"Single output EG","EG500P/F","GRS905\nGRS895",80,120,80,120,5,"rear","CCW"]
["EG651P (GR)","03853AK","pump",1.28,0,800,null,null,null,"Single output EG","EG501P/F","GR905\nGR875",80,120,80,120,5,"rear","CCW"]
["EG651P (GRS)","6392AK","pump",1.28,1.58,800,null,800,null,"Single output EG",null,"GRS905\nGRS895",80,120,80,120,5,"rear","CCW"]
["EG652P (GRSO)","6392AL","pump",0.82,1.03,1300,null,1300,null,"Single output EG","EG501P/F","GRSO905\nGRSO925",80,120,80,120,5,"rear","CCW"]
["EG653P (GRSO)","6392AM","pump",1.03,1.29,800,null,800,null,"Single output EG",null,"GRSO905\nGRSO925",80,120,80,120,5,"rear","CCW"]
["EG654 (GR)",null,"pump",1,0,1200,null,null,null,"Discontinued",null,"GR875",74,110,null,null,5,"rear","CCW"]
["EG654 (GRS)",null,"pump",1,1.24,1200,null,1200,null,"Discontinued",null,"GRS895",74,110,74,110,5,"rear","CCW"]
["EG655 (GR)",null,"pump",1.28,0,700,null,null,null,"Discontinued",null,"GR875",74,110,null,null,5,"rear","CCW"]
["EG655 (GRS)",null,"pump",1.28,1.58,700,null,700,null,"Discontinued",null,"GRS895",74,110,74,110,5,"rear","CCW"]
["EG660F (GR)","6392AN","flange",1,0,1300,null,null,null,"Single output EG","EG500P/F","GR905\nGR875",80,120,80,120,5,"rear","CCW"]
["EG660F (GRS)","6392AN","flange",1,1.24,1300,null,1300,null,"Single output EG","EG500P/F","GRS905\nGRS895",80,120,80,120,5,"rear","CCW"]
["EG661F (GR)","6392AP","flange",1.28,0,800,null,null,null,"Single output EG",null,"GR905\nGR875",80,120,null,null,5,"rear","CCW"]
["EG661F (GRS)","6392AP","flange",1.28,1.58,800,null,800,null,"Single output EG",null,"GRS905\nGRS895",80,120,80,120,5,"rear","CCW"]
["EG662F (GRSO)","6392AQ","flange",0.82,1.03,1300,null,1300,null,"Single output EG","EG501P/F","GRSO905\nGRSO925",80,120,80,120,5,"rear","CCW"]
["EG663F (GRSO)","6392AR","flange",1.03,1.29,800,null,800,null,"Single output EG",null,"GRSO905\nGRSO925",80,120,80,120,5,"rear","CCW"]
["EG664 (GR)",null,"flange",1,0,1200,null,null,null,"Discontinued",null,"GR875",74,110,null,null,5,"side","CCW"]
["EG664 (GRS)",null,"flange",1,1.24,1200,null,1200,null,"Discontinued",null,"GRS895",74,110,74,110,5,"side","CCW"]
["EG665 (GR)",null,"flange",1.28,0,700,null,null,null,"Discontinued",null,"GR875",74,110,null,null,5,"side","CCW"]
["EG665 (GRS)",null,"flange",1.28,1.58,700,null,700,null,"Discontinued",null,"GRS895",74,110,74,null,5,"side","CCW"]
["EG670F (GR)","6392BH","flange",1.61,null,500,null,null,null,"Single output EG",null,"GR875\nGR905",110,110,null,null,5,"rear","CW"]
["EG670F (GRS)","6392BH","flange",1.61,1.99,500,null,500,null,"Single output EG",null,"GRS895\nGRS905",110,110,null,null,5,"rear","CW"]
["EG670PF (GR) L","6392BB","pump L",1.21,null,800,null,800,null,"Double outputs, Can be operated separatly",null,"GR875\nGR905",110,110,null,null,5,"rear","CW"]
["EG670PF (GR) U","6392BB","flange U",1.61,null,500,null,null,null,"Double outputs, Can be operated separatly",null,"GR875\nGR905",110,110,null,null,5,"rear","CW"]
["EG670PF (GRS) L","6392BB","pump 1",1.21,1.49,800,null,800,null,"Double outputs, Can be operated separatly",null,"GRS895\nGRS905",110,110,null,null,5,"rear","CW"]
["EG670PF (GRS) U","6392BB","flange 2",1.61,1.99,500,null,500,null,"Double outputs, Can be operated separatly",null,"GRS895\nGRS905",110,110,null,null,5,"rear","CW"]
["EG670PP (GR) L","6392BA","pump 1",1.55,null,600,null,null,null,"Double outputs, Can be operated separatly",null,"GR875\nGR905",110,110,null,null,5,"rear","CW"]
["EG670PP (GR) U","6392BA","pump 2",1.24,null,800,null,800,null,"Double outputs, Can be operated separatly",null,"GR875\nGR905",110,110,null,null,5,"rear","CW"]
["EG670PP (GRS) L","6392BA","pump 1",1.55,1.91,600,null,600,null,"Double outputs, Can be operated separatly",null,"GRS895\nGRS905",110,110,null,null,5,"rear","CW"]
["EG670PP (GRS) U","6392BA","pump 2",1.24,1.53,800,null,800,null,"Double outputs, Can be operated separatly",null,"GRS895\nGRS905",110,110,null,null,5,"rear","CW"]
["EG671F (GR)","6392BJ","flange",2.06,null,500,null,null,null,"Single output EG",null,"GR875\nGR905",110,110,null,null,5,"rear","CW"]
["EG671F (GRS)","6392BD","flange",2.06,2.5499999999999998,500,null,500,null,"Single output EG",null,"GRS895\nGRS905",110,110,null,null,5,"rear","CW"]
["EG671PF (GR) U","6392BD","pump",1.55,null,600,null,null,null,"Double outputs, Can be operated separatly",null,"GR875\nGR905",110,110,null,null,5,"rear","CW"]
["EG671PF (GR) L","6392BD","flange",2.06,null,500,null,null,null,"Double outputs, Can be operated separatly",null,"GR875\nGR905",110,110,null,null,5,"rear","CW"]
["EG671PF (GRS) L","6392BD","pump 1",1.55,1.91,600,null,600,null,"Double outputs, Can be operated separatly",null,"GRS895\nGRS905",110,110,null,null,5,"rear","CW"]
["EG671PF (GRS) U","6392BD","flange 2",2.06,2.5499999999999998,500,null,500,null,"Double outputs, Can be operated separatly",null,"GRS895\nGRS905",110,110,null,null,5,"rear","CW"]
["EG671PP (GR) L","6392BC","pump 1",1.55,null,600,null,null,null,"Double outputs, Can be operated separatly",null,"GR875\nGR905",110,110,null,null,5,"rear","CW"]
["EG671PP (GR) U","6392BC","pump 2",1.24,null,800,null,null,null,"Double outputs, NOT operated separatly",null,"GR875\nGR905",110,110,null,null,5,"rear","CW"]
["EG671PP (GRS) L","6392BC","pump 1",1.55,1.91,600,null,600,null,"Double outputs, NOT operated separatly",null,"GRS895\nGRS905",110,110,null,null,5,"rear","CW"]
["EG671PP (GRS) U","6392BC","pump 2",1.24,1.53,800,null,800,null,"Double outputs, NOT operated separatly",null,"GRS895\nGRS905",110,110,null,null,5,"rear","CW"]
["EG672F (GRSO)","6392BK","flange",1.61,2.08,500,null,500,null,"Double outputs, NOT operated separatly",null,"GRSO905\nGRSO925",110,110,null,null,5,"rear","CW"]
["EG672PF (GRSO) L","6392BE","pump",1.25,1.56,600,null,600,null,"Double outputs, Can be operated separatly",null,"GRSO905\nGRSO925",110,110,null,null,5,"rear","CW"]
["EG672PF (GRSO) U","6392BE","flange",1.66,2.08,500,null,500,null,"Double outputs, Can be operated separatly",null,"GRSO905\nGRSO925",110,110,null,null,5,"rear","CW"]
["EG672PP (GRSO) L","6392BF","pump 2",1,1.25,800,null,800,null,"Double outputs, Can be operated separatly",null,"GRSO905\nGRSO925",110,110,null,null,5,"rear","CW"]
["EG672PP (GRSO) U","6392BF","pump 1",1.25,1.56,600,null,600,null,"Double outputs, Can be operated separatly",null,"GRSO905\nGRSO925",110,110,null,null,5,"rear","CW"]
["EG673PP (GRSO)  U","6392BG","pump 2",1,1.25,800,null,800,null,"Double outputs, NOT operated separatly",null,"GRSO905\nGRSO925",110,110,null,null,5,"rear","CW"]
["EG673PP (GRSO) L","6392BG","pump 1",1.25,1.56,600,null,600,null,"Double outputs, NOT operated separatly",null,"GRSO905\nGRSO925",110,110,null,null,5,"rear","CW"]
["EG6RDDP1","6392EE","pump or flange",1.63,2.09,600,null,600,null,"Single PTO w high ratio",null,"G25, G33, G38",100,160,100,160,5,"rear","CCW"]
["EG8RDCP1","6392ED","pump or flange",1.51,1.95,800,null,800,null,"Single PTO w high ratio",null,"G25, G33, G38",100,160,100,160,5,"rear","CCW"]
["EG9RDCP1","6392EC","pump or flange",1.39,1.79,860,null,860,null,"Single PTO w high ratio",null,"G25, G33, G38",100,160,100,160,5,"rear","CCW"]
["EK630P","1298E","pump",1,1,1200,null,1200,null,"200Nm while running. \nClutch independant, Discontinued ","Not with 2P-optic","GR801\nGR900\nGRS890\nGRS900\nGRSO900",110,140,110,140,12,"engine","CCW"]
["EK640F","1298F","flange",1,1,1200,null,1200,null,"200Nm while running. \nClutch independant. Discontinued","Not with 2P-optic","GR801\nGR900\nGRS890\nGRS900\nGRSO900",110,140,110,140,12,"engine","CCW"]
["EG730P","6389HA","pump",1,1,2000,null,2000,null,"Clutch dependant",null,"GRS895\nGR905\nGRS905\nGRSO905",120,250,120,250,12,"engine","CCW"]
["EG740F","6389HB","flange",1,1,2000,null,2000,null,"Clutch dependant",null,"GRS895\nGR905\nGRS905\nGRSO905",120,250,120,250,12,"engine","CCW"]
["EK730P","1298G","pump",1,1,2000,null,2000,null,"300Nm while running. \nClutch independant",null,"GRS895\nGR905\nGRS905\nGRSO905",120,250,120,250,12,"engine","CCW"]
["EK740F","1298H","flange",1,1,2000,null,2000,null,"200Nm while running. \nClutch independant",null,"GRS895\nGR905\nGRS905\nGRSO905",120,250,120,250,12,"engine","CCW"]
["EK750F","1298K","flange",1,1,1000,null,1000,null,"300Nm while running.\nWith external clutch",null,"GRS895\nGR905\nGRS905\nGRSO905",120,170,120,170,12,"engine","CCW"]

{"sheet":"Hydraulic pumpdata","index":84,"n_rows":52,"n_cols":12,"rows_kept":52,"cut":false,"hidden":false,"merged":[[0,1,1,9]]}
[null,"Hydraulic pump data"]
[]
["Hydraulic Pump","Info","displacement","pump rev.","max rev.","flow","power","torque","weight","pressure","max pressure","efficiency"]
[null,null,"cm3/rev","rpm","rpm","l/min","kW","Nm","kg","bar","bar"]
["Sunfab SC 084","fast",83.6,1000,1500,{"$f":"(D5*C5)/1000","v":83.6},100,null,28,350,400,0.95]
["Parker F1-101","fixed",102.9,1800,1800,{"$f":"(D6*C6)/1000","v":185.22},86,572,12.5,350,400,0.98]
["Parker VP1-095","variable",95,1750,1800,{"$f":"(D7*C7)/1000","v":166.25},null,null,27,400,420,0.98]
["Parker VP1-120","variable",120,1400,1800,{"$f":"(D8*C8)/1000","v":168},125,null,27,380,400,0.98]
["Rexroth A17FNO-125","fixed pump",125,1800,1800,225,94,497,15,350,300,0.95]
["Rexroth A17FO-107","fixed pump",107,1860,1860,198,99,509,15,300,350,0.95]
["Hydro Leduc TXV92","variable",92,1900,1900,{"$f":"(D11*C11)/1000","v":174.8},null,483,26.8,380,400,0.95]
["Parker VP1-130","variable",128,1500,1900,{"$f":"(D12*C12)/1000","v":192},null,null,null,400,420,0.95]
["Sunfab SC 047","fast",47.1,1000,1900,{"$f":"(D13*C13)/1000","v":47.1},65,null,16.5,350,400,0.95]
["Sunfab SC 067","fast",63.5,1000,1900,{"$f":"(D14*C14)/1000","v":63.5},null,null,11.7,350,400,0.95]
["Parker F1-81","fixed",81.599999999999994,1400,2000,163,76,453,12.5,350,400,0.98]
["Hydro Leduc TXV120","variable",120,2100,2100,{"$f":"(D16*C16)/1000","v":252},null,680,26.8,360,380,0.95]
["Hydro Leduc TXV130","variable",130,2100,2100,{"$f":"(D17*C17)/1000","v":273},null,730,27.2,360,380,0.95]
["Parker VP1-075","variable",75,1700,2100,{"$f":"(D18*C18)/1000","v":127.5},100,null,27,350,400,0.98]
["Rexroth A10VO-140","variable with\nSAE-flange",140,1800,2100,252,118,623,60,280,350,0.95]
["Sunfab SVH 130","variabel",130,1000,2100,{"$f":"(D20*C20)/1000","v":130},120,400,30.8,400,450,0.95]
["Rexroth A17FO-80","fixed pump",80,2130,2130,171,86,384,12,300,350,0.95]
["Rexroth A18FDO-80","2-circuit fixed pump\n2 x 80",160,1500,2150,240,140,891,25,350,400,0.95]
["Parker F1-51","fixed",51.1,2200,2200,{"$f":"(D23*C23)/1000","v":112.42},52,284,8.5,350,400,0.98]
["Parker F1-61","fixed",59.5,2200,2200,{"$f":"(D24*C24)/1000","v":130.9},61,331,8.5,350,400,0.98]
["Sunfab SC 9084","fast",83.6,1700,2200,{"$f":"(D25*C25)/1000","v":142.12},null,null,17,400,450,0.95]
["Sunfab SVH 112","variabel",112,1000,2200,{"$f":"(D26*C26)/1000","v":112},null,600,28.1,350,400,0.95]
["Rexroth A17FO-63","fixed pump",63,2300,2300,145,72,301,9,300,350,0.95]
["Parker VP1-045","variable",45,1000,2400,{"$f":"(D28*C28)/1000","v":45},60,null,null,300,null,0.98]
["Rexroth A10VO-100","variable with\nSAE-flange",100,2000,2400,200,93,445,45,280,350,0.95]
["Sunfab SVH 092","variabel",92,1000,2400,{"$f":"(D30*C30)/1000","v":92},null,530,25.8,350,400,0.95]
["Rexroth A18FDO-63","2-circuit fixed pump\n2 x 63  ",126,1700,2450,214,125,702,21,350,400,0.95]
["Hyva 0113L-BI-4H5-4P-20BSP20-250","gear",113,2000,2500,208,null,480,20.8,250,255,0.98]
["Hyva 035L-BI-4H-BRITE","gear",35,2000,2500,{"$f":"(D33*C33)/1000","v":70},null,150,12.5,250,280,0.98]
["Hyva 061L-BI-4H-C 1773053","gear",61,2000,2500,64,null,260,14,250,255,0.98]
["Hyva 082L-BI-4H-C 1773055","gear",82,2000,2500,150,null,345,16,225,255,0.98]
["Hyva 085L-BI-4H3-2R-20BSP20-250","gear",85,2000,2500,157,null,null,14,230,255,0.98]
["Parker F2-53/53 A","Twinflow 53A",54,1800,2550,{"$f":"(D37*C37)/1000","v":97.2},88,294,19,350,null,0.98]
["Parker F2-53/53 B","Twinflow 53B",52,1800,2550,{"$f":"(D38*C38)/1000","v":93.6},88,289,19,350,null,0.98]
["Parker F2-70/35 A","Twinflow 70A",69,1800,2550,{"$f":"(D39*C39)/1000","v":124.2},88,283,19,350,null,0.98]
["Parker F2-70/35 B","Twinflow 35B",36,1800,2550,{"$f":"(D40*C40)/1000","v":64.8},88,200,19,350,null,0.98]
["Rexroth A17FO-45","fixed pump",45,2560,2560,117,58,218,8,300,350,0.95]
["Rexroth A17FO-32","fixed pump",32,2900,2900,93,46,153,6,300,350,0.95]
["Rexroth A17VO-107","variable pump",107,2150,2900,230,134,596,24,300,350,0.95]
["Rexroth A18VO-107","variable pump  ",107,2150,2900,230,134,596,24,350,400,0.95]
["Rexroth A17FO-23","fixed pump",23,2920,2920,67,33,109,6,300,350,0.95]
["Hawe V60N-110","variable",110,2200,3000,{"$f":"(D46*C46)/1000","v":242},97.2,600,30,350,400,0.98]
["Hawe V60N-130","variable",130,2100,3000,273,120,700,30.8,400,450,0.98]
["Hawe V60N-60","variable",60,2500,3000,{"$f":"(D48*C48)/1000","v":150},53,430,24,350,400,0.98]
["Hawe V60N-90","variable",90,2300,3000,{"$f":"(D49*C49)/1000","v":207},79.5,530,27,350,400,0.98]
["Rexroth A17VO-80","variable pump  ",80,2240,3000,179,104,446,20,300,350,0.95]
["Rexroth A18VO-80","variable pump  ",80,2240,3000,179,104,446,20,350,400,0.95]
["Rexroth A17VO-55","variable pump",55,2500,3400,137,68,261,16,300,350,0.95]

{"sheet":"Cranes","index":85,"n_rows":32,"n_cols":9,"rows_kept":32,"cut":false,"hidden":false,"merged":[[1,2,3,7]]}
[]
[null,null,"Cranes",null,null,null,null,null,"Updated 2020-02-24"]
[]
[]
[]
["Kranar:",null,"Working pressure","oil flow","power\ndemands"]
[null,null,"bar","L/min","kW"]
["A1 Optional pressure.\nPTO configurator",null,{"$f":"B2","v":0},"-","-"]
["B 75 bar",null,75,"-","-"]
["C 100 bar",null,100,"-","-"]
["D 150 bar",null,150,"-","-"]
["E 200 bar",null,200,"-","-"]
["F 250 bar",null,250,"-","-"]
["FTG V-Kran V12Z 89 (240bar)",null,240,90,"-"]
["FTG V-Kran V25 120 (260bar)",null,260,90,"-"]
["G 300 bar",null,300,"-","-"]
["H 350 bar",null,350,"-","-"]
["Hinz Epsilon M130Z (260bar)",null,260,80,"-"]
["Hinz Epsilon M130Z HPLS (290bar)",null,290,130,"-"]
["J   375 bar",null,375,"-","-"]
["Jonsered J1020 10tm (250bar)",null,250,90,38]
["Jonsered J2990 30tm  (250bar)",null,250,150,60]
["Loglift F105  (230bar)",null,230,80,68]
["Loglift F95 S  (220bar)",null,220,80,60]
["Loglift F96 S  (240bar)\nvp 160-200L/min / fp 80-90l/min",null,240,170,"-"]
["Palfinger PK100002 (365bar)",null,365,110,"-"]
["Palfinger PK100002 (365bar)",null,365,110,"-"]
["Palfinger PK150002  (330bar)",null,330,200,"-"]
["Palfinger PK32080 (300bar)",null,300,50,"-"]
["Palfinger PK60002 (350bar)",null,365,100,"-"]
["Penz 23000 (260bar)",null,260,90,"-"]
["Penz 30.80 (270bar)",null,270,90,75]

{"sheet":"PTO GZ","index":86,"n_rows":22,"n_cols":27,"rows_kept":22,"cut":false,"hidden":false,"merged":[[0,20,0,21],[0,26,0,27],[20,15,20,18],[20,19,20,22]]}
[null,null,null,null,null,null,null,null,null,null,null,null,null,null,null,null,null,null,null,null,null,null,null,null,null,null,"Updated 2020-02-24"]
[]
[]
[]
[]
[]
[]
[]
[]
[]
[]
[]
[]
[null,null,null,null,null,null,null,null,null,null,null,"PTO","Cabel","Switch"]
[null,null,null,null,null,null,null,null,null,null,null,"EK","V43","S31"]
[null,null,null,null,null,null,null,null,null,null,null,"ED1","V122","S168"]
[null,null,null,null,null,null,null,null,null,null,null,"ED2","V150","S169"]
[null,null,null,null,null,null,null,null,null,null,null,"EG1","V13","S30"]
[null,null,null,null,null,null,null,null,null,null,null,"EG2","V133","S164"]
[null,null,null,null,null,null,null,null,null,null,null,"EG3","V181"]
[null,null,null,null,null,null,null,null,null,null,null,"AWD","V151","S170"]
[null,null,null,null,null,null,null,null,null,null,null,"Splitshaft","V152","S171"]

{"sheet":"EG PTO GW","index":87,"n_rows":41,"n_cols":19,"rows_kept":41,"cut":false,"hidden":false,"merged":[]}
[null,null,null,null,null,null,null,null,null,null,null,null,null,null,null,null,null,null,"Updated 2020-02-24"]
[]
[]
[]
[]
[]
[]
[]
[]
[]
[]
[]
[]
[]
[]
[]
[]
[]
[]
[]
[null,"Designation","Ratio: Low - High split","Torque (Nm)","Max output power (kW)","Rotates","Interface",null,"Designation","Ratio: Low - High split","Max Torque output entire PTO (Nm)","Max Torque on upper output  (Nm)","Max Torque on lower output  (Nm)","Max output power entire  PTO (kW)","Max output power on one output PTO (kW)","Rotates","Independent engagment","Interface"]
[null,"EG10R DCP1B","1.19-1.53",1000,"100/160*","CCW","P1 (ISO7653-D)",null,"EG16R DCP1P1","1.19-1.53",1600,600,1000,"100/240*","100/160","CCW","Yes","P1 (ISO7653-D)"]
[null,"EG9R DCP1B","1.39-1.79",860,"100/160*","CCW","P1 (ISO7653-D)",null,"EG13R DCP1P1","1.39-1.79",1300,520,860,"100/240*","100/160","CCW","Yes","P1 (ISO7653-D)"]
[null,"EG8R DCP1B","1.51-1.95",800,"100/160*","CCW","P1 (ISO7653-D)",null,"EG12R DCP1P1","1.51-1.95",1200,480,800,"100/240*","100/160","CCW","Yes","P1 (ISO7653-D)"]
[null,"EG6R DDP1B","1.63-2.09",600,"100/160*","CCW","P1 (ISO7653-D)",null,"EG11R DDP1P1","1.63-2.09",1100,360,600,"100/240*","100/160","CCW","Yes","P1 (ISO7653-D)"]
[]
[]
[]
[]
[]
[]
[]
[]
[]
[]
[]
[]
[]
[]
[null,null,null,null,null,null,"Designation","Ratio: Low - High split","Torque (Nm)","Max output power (kW)","Rotates","Interface"]
[null,null,null,null,null,null,"EG25R DAP1","0.76-0.97",2500,260,"CW","P1 (ISO7653-D)"]

{"sheet":"EG PTO GW adaption","index":88,"n_rows":19,"n_cols":17,"rows_kept":19,"cut":false,"hidden":false,"merged":[]}
[null,null,null,null,null,null,null,null,null,null,null,null,null,null,null,null,"Updated 2020-02-24"]
[]
[]
[]
[]
[]
[]
[]
[]
[]
[]
[]
[]
[null,"Designation","Interface"]
[null,"F1","SAE1410 (ISO7647-1400)"]
[null,"F2","DIN90 (ISO7646-90x4x8)"]
[null,"F3","DIN100 (ISO7646-100x6x8)"]
[null,"F4","DIN120 (ISO7646-120x8x10)"]
[null,"F6","SAE1310 (ISO7647-1300)"]